{"text_format":"1","workbook":"xlsx","n_sheets":14,"sheets":["NOMBRE","P1","P2","P3","P4","P5","P6","P7","P9","P11","P12","P13","Contro","MACROS"],"not_rendered":{"charts":0,"images":0,"macros":1,"external_links":0,"defined_names":10,"comments":0,"pivot_tables":0},"unopened":[],"bounds":{"document_bytes":16777216,"sheet_cells":100000,"rows_first":2000,"rows_last":500,"rows_between":2000,"halvings":0,"cell_chars":16384,"cell_head_chars":4096},"cells_cut":0,"cells_raw":0,"read":"whole","date_system":"1900"}

{"sheet":"NOMBRE","index":0,"n_rows":43,"n_cols":33,"rows_kept":43,"cut":false,"hidden":false,"merged":[[16,1,18,1],[0,0,0,1],[0,2,0,7],[8,0,8,1],[14,0,14,1]]}
[null,null,"CÓDIGOS"]
["NOMBRE DE COMUNA",null,null,null,null,null,null,null,{"$f":"IF(OR(NOMBRE!C2=\"\",NOMBRE!D2=\"\",NOMBRE!E2=\"\",NOMBRE!F2=\"\",NOMBRE!G2=\"\"),\"Falta Cód. Com.\",\"\")","v":"Falta Cód. Com."},null,null,null,null,null,null,null,null,null,null,null,null,null,null,null,null,null,null,null,null,null,null,null,{"$f":"IF(I2>\"\",1,0)","v":1}]
["NOMBRE ESTABLECIMIENTO/ESTRATEGIA",null,null,null,null,null,null,null,{"$f":"IF(OR(NOMBRE!C3=\"\",NOMBRE!D3=\"\",NOMBRE!E3=\"\",NOMBRE!F3=\"\",NOMBRE!G3=\"\",NOMBRE!H3=\"\"),\"Falta Cód. Est.\",\"\")","v":"Falta Cód. Est."},null,null,null,null,null,null,null,null,null,null,null,null,null,null,null,null,null,null,null,null,null,null,null,{"$f":"IF(I3>\"\",1,0)","v":1}]
["TIPO DE ESTABLECIMIENTO/ESTRATEGIA",null,null,null,null,null,null,null,{"$f":"IF(OR(NOMBRE!B4=\"\"),\"Falta Tipo. Est.\",\"\")","v":"Falta Tipo. Est."},null,null,null,null,null,null,null,null,null,null,null,null,null,null,null,null,null,null,null,null,null,null,null,{"$f":"IF(I4>\"\",1,0)","v":1}]
["DEPENDENCIA",null,null,null,null,null,null,null,{"$f":"IF(OR(NOMBRE!B5=\"\"),\"Falta Dependencia. Est.\",\"\")","v":"Falta Dependencia. Est."},null,null,null,null,null,null,null,null,null,null,null,null,null,null,null,null,null,null,null,null,null,null,null,{"$f":"IF(I5>\"\",1,0)","v":1}]
["MES:",null,null,null,null,null,null,null,{"$f":"IF(OR(NOMBRE!C6=\"\",NOMBRE!D6=\"\"),\"Falta Cód. Mes.\",\"\")","v":"Falta Cód. Mes."},null,null,null,null,null,null,null,null,null,null,null,null,null,null,null,null,null,null,null,null,null,null,null,{"$f":"IF(I6>\"\",1,0)","v":1}]
["AÑO:",2023,null,null,null,null,null,null,null,null,null,null,null,null,null,null,null,null,null,null,null,null,null,null,null,null,null,null,null,null,null,null,{"$f":"SUM(AG2:AG6)","v":5}]
[]
["Versión 1.0: Junio 2023 "]
[]
["Director Servicio de Salud o Director Establecimiento",null,null,null,null,null,null,null,null,null,null,null,null,null,null,null,null,null,null,null,null,null,null,null,null,null,"JUNIO","Establecimiento de Mayor Complejidad (EMAYC)","SERVICIO DE SALUD"]
["Jefe de Estadisticas",null,null,null,null,null,null,null,null,null,null,null,null,null,null,null,null,null,null,null,null,null,null,null,null,null,"DICIEMBRE","Establecimiento de Mediana Complejidad (EMEDC)","MUNICIPAL"]
[null,null,null,null,null,null,null,null,null,null,null,null,null,null,null,null,null,null,null,null,null,null,null,null,null,null,null,"Establecimiento de Menor Complejidad (EMENC)","Organizaciones sin fines de lucro y ONG (DELEGADO)"]
[null,null,null,null,null,null,null,null,null,null,null,null,null,null,null,null,null,null,null,null,null,null,null,null,null,null,null,"Centros de Diagnóstico Terapéutico (CDT)"]
["MINSAL - DEIS",null,null,null,null,null,null,null,null,null,null,null,null,null,null,null,null,null,null,null,null,null,null,null,null,null,null,"Centro de Referencia de Salud (CRS)"]
[null,null,null,null,null,null,null,null,null,null,null,null,null,null,null,null,null,null,null,null,null,null,null,null,null,null,null,"Centro de Salud Familiar"]
[null,"SERIE P\n",null,null,null,null,null,null,null,null,null,null,null,null,null,null,null,null,null,null,null,null,null,null,null,null,null,"Consultorio General Urbano (CGU)"]
[null,null,null,null,null,null,null,null,null,null,null,null,null,null,null,null,null,null,null,null,null,null,null,null,null,null,null,"Consultorio General Urbano (CGU) - CESFAM"]
[null,null,null,null,null,null,null,null,null,null,null,null,null,null,null,null,null,null,null,null,null,null,null,null,null,null,null,"Consultorio General Urbano(CGU) con SAPU/SUR/SAR"]
[null,null,null,null,null,null,null,null,null,null,null,null,null,null,null,null,null,null,null,null,null,null,null,null,null,null,null,"Consultorio General Urbano (CGU) - CESFAM con SAPU/SAR"]
[null,null,null,null,null,null,null,null,null,null,null,null,null,null,null,null,null,null,null,null,null,null,null,null,null,null,null,"Consultorio General Rural (CGR)"]
[null,null,null,null,null,null,null,null,null,null,null,null,null,null,null,null,null,null,null,null,null,null,null,null,null,null,null,"Consultorio General Rural (CGR) - CESFAM"]
[null,null,null,null,null,null,null,null,null,null,null,null,null,null,null,null,null,null,null,null,null,null,null,null,null,null,null,"Consultorio General Rural (CGR) con SAPU/SAR/SUR"]
[null,null,null,null,null,null,null,null,null,null,null,null,null,null,null,null,null,null,null,null,null,null,null,null,null,null,null,"Consultorio General Rural (CGR) - CESFAM con SAPU/SAR/SUR"]
[null,null,null,null,null,null,null,null,null,null,null,null,null,null,null,null,null,null,null,null,null,null,null,null,null,null,null,"Posta de Salud Rural (PSR)"]
[null,null,null,null,null,null,null,null,null,null,null,null,null,null,null,null,null,null,null,null,null,null,null,null,null,null,null,"Centro Comunitario de Salud Familiar (CECOF)"]
[null,null,null,null,null,null,null,null,null,null,null,null,null,null,null,null,null,null,null,null,null,null,null,null,null,null,null,"Consultorio de Salud Mental (COSAM)"]
[null,null,null,null,null,null,null,null,null,null,null,null,null,null,null,null,null,null,null,null,null,null,null,null,null,null,null,"Programa de Reparación y Atención Integral de Salud (PRAIS)"]
[null,null,null,null,null,null,null,null,null,null,null,null,null,null,null,null,null,null,null,null,null,null,null,null,null,null,null,"Centro de Atención Funcionarios (CAF)"]
[null,null,null,null,null,null,null,null,null,null,null,null,null,null,null,null,null,null,null,null,null,null,null,null,null,null,null,"Unidad de Salud de Funcionarios (USF)"]
[null,null,null,null,null,null,null,null,null,null,null,null,null,null,null,null,null,null,null,null,null,null,null,null,null,null,null,"Clinica Dental Movil (CDM)"]
[null,null,null,null,null,null,null,null,null,null,null,null,null,null,null,null,null,null,null,null,null,null,null,null,null,null,null,"Centro de Salud Urbano (CSU)"]
[null,null,null,null,null,null,null,null,null,null,null,null,null,null,null,null,null,null,null,null,null,null,null,null,null,null,null,"Dirección Servicio de Salud (DSS)"]
[null,null,null,null,null,null,null,null,null,null,null,null,null,null,null,null,null,null,null,null,null,null,null,null,null,null,null,"Servicio de Atención Primaria de Urgencia (SAPU)"]
[null,null,null,null,null,null,null,null,null,null,null,null,null,null,null,null,null,null,null,null,null,null,null,null,null,null,null,"Servicio Alta Resolución (SAR)"]
[null,null,null,null,null,null,null,null,null,null,null,null,null,null,null,null,null,null,null,null,null,null,null,null,null,null,null,"Servicio de Urgencia Rural (SUR)"]
[null,null,null,null,null,null,null,null,null,null,null,null,null,null,null,null,null,null,null,null,null,null,null,null,null,null,null,"Laboratorio Clinico o Dental "]
[null,null,null,null,null,null,null,null,null,null,null,null,null,null,null,null,null,null,null,null,null,null,null,null,null,null,null,"Servicio de Atención Primaria de Urgencia Dental (SAPUDENT)"]
[null,null,null,null,null,null,null,null,null,null,null,null,null,null,null,null,null,null,null,null,null,null,null,null,null,null,null,"Centro de Rehabilitacion (CR) "]
[null,null,null,null,null,null,null,null,null,null,null,null,null,null,null,null,null,null,null,null,null,null,null,null,null,null,null,"Hospital de Campaña"]
[null,null,null,null,null,null,null,null,null,null,null,null,null,null,null,null,null,null,null,null,null,null,null,null,null,null,null,"Centro Oncologico"]
[null,null,null,null,null,null,null,null,null,null,null,null,null,null,null,null,null,null,null,null,null,null,null,null,null,null,null,"SAMU"]
[null,null,null,null,null,null,null,null,null,null,null,null,null,null,null,null,null,null,null,null,null,null,null,null,null,null,null,"Centro de Salud Urbano (CSU)"]

{"sheet":"P1","index":1,"n_rows":149,"n_cols":113,"rows_kept":149,"cut":false,"hidden":false,"merged":[[92,0,92,1],[107,0,108,0],[107,2,108,2],[107,3,107,11],[109,0,113,0],[107,1,108,1],[93,0,93,1],[8,18,9,18],[19,0,20,0],[23,0,23,1],[27,0,27,1],[24,0,24,1],[25,0,25,1],[21,0,22,0],[8,17,9,17],[8,2,9,2],[8,16,9,16],[26,0,26,1],[10,0,10,1],[8,3,8,15],[18,0,18,1],[12,0,17,0],[48,1,49,1],[28,0,28,1],[48,2,49,2],[35,2,36,2],[35,4,36,4],[35,3,36,3],[35,0,36,0],[35,1,36,1],[29,0,30,0],[31,0,32,0],[33,0,33,1],[5,2,5,15],[75,0,75,4],[34,0,34,5],[115,0,115,7],[82,0,82,1],[56,0,57,0],[56,1,57,1],[56,2,57,2],[58,0,62,0],[63,0,67,0],[55,0,55,11],[35,5,36,5],[48,0,49,0],[56,3,56,11],[6,0,6,6],[8,0,9,1],[84,3,84,7],[84,0,85,1],[84,2,85,2],[84,8,85,8],[84,9,85,9],[88,0,88,1],[89,0,89,1],[90,0,90,1],[91,0,91,1],[86,0,86,1]]}
["DATOS DEL ESTABLECIMIENTO"]
[{"$f":"CONCATENATE(\"COMUNA: \",NOMBRE!$B$2,\" - \",\"( \",NOMBRE!$C$2,NOMBRE!$D$2,NOMBRE!$E$2,NOMBRE!$F$2,NOMBRE!$G$2,\" )\")","v":"COMUNA:  - (  )"}]
[{"$f":"CONCATENATE(\"ESTABLECIMIENTO/ESTRATEGIA: \",NOMBRE!$B$3,\" - \",\"( \",NOMBRE!$C$3,NOMBRE!$D$3,NOMBRE!$E$3,NOMBRE!$F$3,NOMBRE!$G$3,NOMBRE!$H$3,\" )\")","v":"ESTABLECIMIENTO/ESTRATEGIA:  - (  )"}]
[{"$f":"CONCATENATE(\"MES: \",NOMBRE!$B$6,\" - \",\"( \",NOMBRE!$C$6,NOMBRE!$D$6,\" )\")","v":"MES:  - (  )"}]
[{"$f":"CONCATENATE(\"AÑO: \",NOMBRE!$B$7)","v":"AÑO: 2023"}]
[null,null,"REM-P1. POBLACIÓN EN CONTROL PROGRAMA DE SALUD DE LA MUJER"]
["ATENCIÓN PRIMARIA DE SALUD"]
["SECCION A: POBLACIÓN EN CONTROL SEGÚN MÉTODO DE REGULACIÓN DE FERTILIDAD Y SALUD SEXUAL"]
["MÉTODOS",null,"TOTAL","GRUPO DE EDAD (en años)",null,null,null,null,null,null,null,null,null,null,null,null,"Pueblos Originarios","Población Migrantes","PV-VIH (personas viviendo con VIH)"]
[null,null,null,"Menor \nde 15 años","15 a 19 años","20 a 24 años","25 a 29 años","30 a 34 años","35 a 39 años","40 a 44 años","45 a 49 años","50 a 54 años","55 a 59 años","60 a 64 años","65 a 69 años","70 y mas años"]
["D . I . U T con Cobre",null,{"$f":"SUM(D11:M11)","v":0},null,null,null,null,null,null,null,null,null,null,null,null,null,null,null,null,null,null,null,null,null,null,null,null,null,null,null,null,null,null,null,null,null,null,null,null,null,null,null,null,null,null,null,null,null,null,null,null,null,null,null,null,null,null,null,null,null,null,null,null,null,null,null,null,null,null,null,null,null,null,null,null,null,null,null,null,{"$f":"IF($Q11>$C11,\"* La celda 'Pueblos Originarios' debe ser menor o igual al Total en control. \",\"\")","v":""},{"$f":"IF($R11>$C11,\"* La celda 'Población Migrantes' debe ser menor o igual al Total en control. \",\"\")","v":""},{"$f":"IF($S11>$C11,\"* La celda 'Personas Viviendo con VIH' debe ser menor o igual al Total en control. \",\"\")","v":""},{"$f":"IF(AND($C11<>0,$Q11=\"\"),\"* No olvide escribir en la celda de 'Pueblos Originarios' (Digite CERO si no tiene). \",\"\")","v":""},{"$f":"IF(AND($C11<>0,$R11=\"\"),\"* No olvide escribir en la celda de 'Población Migrantes' (Digite CERO si no tiene). \",\"\")","v":""},{"$f":"IF(AND($C11<>0,$S11=\"\"),\"* No olvide escribir en la celda de 'PV-VIH' (Digite CERO si no tiene). \",\"\")","v":""},null,null,null,null,null,null,null,null,null,null,null,null,null,null,null,null,null,null,null,null,{"$f":"IF($Q11>$C11,1,0)","v":0},{"$f":"IF($R11>$C11,1,0)","v":0},{"$f":"IF($S11>$C11,1,0)","v":0},{"$f":"IF(AND($C11<>0,$Q11=\"\"),1,0)","v":0},{"$f":"IF(AND($C11<>0,$R11=\"\"),1,0)","v":0},{"$f":"IF(AND($C11<>0,$S11=\"\"),1,0)","v":0}]
["D . I . U con Levonorgestrel",null,0,null,null,null,null,null,null,null,null,null,null,null,null,null,null,null,null,null,null,null,null,null,null,null,null,null,null,null,null,null,null,null,null,null,null,null,null,null,null,null,null,null,null,null,null,null,null,null,null,null,null,null,null,null,null,null,null,null,null,null,null,null,null,null,null,null,null,null,null,null,null,null,null,null,null,null,null,"","","","","","",null,null,null,null,null,null,null,null,null,null,null,null,null,null,null,null,null,null,null,null,0,0,0,0,0,0]
["HORMONAL","Oral Combinado",0,null,null,null,null,null,null,null,null,null,null,null,null,null,null,null,null,null,null,null,null,null,null,null,null,null,null,null,null,null,null,null,null,null,null,null,null,null,null,null,null,null,null,null,null,null,null,null,null,null,null,null,null,null,null,null,null,null,null,null,null,null,null,null,null,null,null,null,null,null,null,null,null,null,null,null,null,"","","","","","",null,null,null,null,null,null,null,null,null,null,null,null,null,null,null,null,null,null,null,null,0,0,0,0,0,0]
[null,"Oral Progestágeno",0,null,null,null,null,null,null,null,null,null,null,null,null,null,null,null,null,null,null,null,null,null,null,null,null,null,null,null,null,null,null,null,null,null,null,null,null,null,null,null,null,null,null,null,null,null,null,null,null,null,null,null,null,null,null,null,null,null,null,null,null,null,null,null,null,null,null,null,null,null,null,null,null,null,null,null,null,"","","","","","",null,null,null,null,null,null,null,null,null,null,null,null,null,null,null,null,null,null,null,null,0,0,0,0,0,0]
[null,"Inyectable Combinado",0,null,null,null,null,null,null,null,null,null,null,null,null,null,null,null,null,null,null,null,null,null,null,null,null,null,null,null,null,null,null,null,null,null,null,null,null,null,null,null,null,null,null,null,null,null,null,null,null,null,null,null,null,null,null,null,null,null,null,null,null,null,null,null,null,null,null,null,null,null,null,null,null,null,null,null,null,"","","","","","",null,null,null,null,null,null,null,null,null,null,null,null,null,null,null,null,null,null,null,null,0,0,0,0,0,0]
[null,"Inyectable Progestágeno",0,null,null,null,null,null,null,null,null,null,null,null,null,null,null,null,null,null,null,null,null,null,null,null,null,null,null,null,null,null,null,null,null,null,null,null,null,null,null,null,null,null,null,null,null,null,null,null,null,null,null,null,null,null,null,null,null,null,null,null,null,null,null,null,null,null,null,null,null,null,null,null,null,null,null,null,null,"","","","","","",null,null,null,null,null,null,null,null,null,null,null,null,null,null,null,null,null,null,null,null,0,0,0,0,0,0]
[null,"Implante Etonogestrel (3 años)",0,null,null,null,null,null,null,null,null,null,null,null,null,null,null,null,null,null,null,null,null,null,null,null,null,null,null,null,null,null,null,null,null,null,null,null,null,null,null,null,null,null,null,null,null,null,null,null,null,null,null,null,null,null,null,null,null,null,null,null,null,null,null,null,null,null,null,null,null,null,null,null,null,null,null,null,null,"","","","","","",null,null,null,null,null,null,null,null,null,null,null,null,null,null,null,null,null,null,null,null,0,0,0,0,0,0]
[null,"Implante Levonorgestrel (5 años)",0,null,null,null,null,null,null,null,null,null,null,null,null,null,null,null,null,null,null,null,null,null,null,null,null,null,null,null,null,null,null,null,null,null,null,null,null,null,null,null,null,null,null,null,null,null,null,null,null,null,null,null,null,null,null,null,null,null,null,null,null,null,null,null,null,null,null,null,null,null,null,null,null,null,null,null,null,"","","","","","",null,null,null,null,null,null,null,null,null,null,null,null,null,null,null,null,null,null,null,null,0,0,0,0,0,0]
["ANILLO VAGINAL",null,0,null,null,null,null,null,null,null,null,null,null,null,null,null,null,null,null,null,null,null,null,null,null,null,null,null,null,null,null,null,null,null,null,null,null,null,null,null,null,null,null,null,null,null,null,null,null,null,null,null,null,null,null,null,null,null,null,null,null,null,null,null,null,null,null,null,null,null,null,null,null,null,null,null,null,null,null,"","","","","","",null,null,null,null,null,null,null,null,null,null,null,null,null,null,null,null,null,null,null,null,0,0,0,0,0,0]
[" SÓLO PRESERVATIVO                                                                                                                                                                                                                                                 ","Mujer",{"$f":"SUM(D20:P20)","v":0},null,null,null,null,null,null,null,null,null,null,null,null,null,null,null,null,null,null,null,null,null,null,null,null,null,null,null,null,null,null,null,null,null,null,null,null,null,null,null,null,null,null,null,null,null,null,null,null,null,null,null,null,null,null,null,null,null,null,null,null,null,null,null,null,null,null,null,null,null,null,null,null,null,null,null,null,"","","","","","",null,null,null,null,null,null,null,null,null,null,null,null,null,null,null,null,null,null,null,null,0,0,0,0,0,0]
[null,"Hombres",{"$f":"SUM(D21:P21)","v":0},null,null,null,null,null,null,null,null,null,null,null,null,null,null,null,null,null,null,null,null,null,null,null,null,null,null,null,null,null,null,null,null,null,null,null,null,null,null,null,null,null,null,null,null,null,null,null,null,null,null,null,null,null,null,null,null,null,null,null,null,null,null,null,null,null,null,null,null,null,null,null,null,null,null,null,null,"","","","","","",null,null,null,null,null,null,null,null,null,null,null,null,null,null,null,null,null,null,null,null,0,0,0,0,0,0]
["ESTERILIZACIÓN QUIRURGICA","Mujer",{"$f":"SUM(D22:M22)","v":0},null,null,null,null,null,null,null,null,null,null,null,null,null,null,null,null,null,null,null,null,null,null,null,null,null,null,null,null,null,null,null,null,null,null,null,null,null,null,null,null,null,null,null,null,null,null,null,null,null,null,null,null,null,null,null,null,null,null,null,null,null,null,null,null,null,null,null,null,null,null,null,null,null,null,null,null,"","","","","","",null,null,null,null,null,null,null,null,null,null,null,null,null,null,null,null,null,null,null,null,0,0,0,0,0,0]
[null,"Hombres",{"$f":"SUM(D23:M23)","v":0},null,null,null,null,null,null,null,null,null,null,null,null,null,null,null,null,null,null,null,null,null,null,null,null,null,null,null,null,null,null,null,null,null,null,null,null,null,null,null,null,null,null,null,null,null,null,null,null,null,null,null,null,null,null,null,null,null,null,null,null,null,null,null,null,null,null,null,null,null,null,null,null,null,null,null,null,"","","","","","",null,null,null,null,null,null,null,null,null,null,null,null,null,null,null,null,null,null,null,null,0,0,0,0,0,0]
[" TOTAL",null,{"$f":"SUM(D24:P24)","v":0},{"$f":"SUM(D11:D23,D30:D31,D34)","v":0},0,0,0,0,0,0,0,0,0,{"$f":"SUM(N20:N21,N30:N31,N34)","v":0},{"$f":"SUM(O20:O21,O30:O31,O34)","v":0},{"$f":"SUM(P20:P21,P30:P31,P34)","v":0},{"$f":"SUM(Q11:Q23,Q30:Q31,Q34)","v":0},{"$f":"SUM(R11:R23,R30:R31,R34)","v":0},{"$f":"SUM(S11:S23,S30:S31,S34)","v":0}]
[" Mujeres en control con enfermedad cardiovascular (DM-HTA)\n",null,{"$f":"SUM(D25:P25)","v":0},null,null,null,null,null,null,null,null,null,null,null,null,null,null,null,null,null,null,null,null,null,null,null,null,null,null,null,null,null,null,null,null,null,null,null,null,null,null,null,null,null,null,null,null,null,null,null,null,null,null,null,null,null,null,null,null,null,null,null,null,null,null,null,null,null,null,null,null,null,null,null,null,null,null,null,null,{"$f":"IF($Q25>$C25,\"* La celda 'Pueblos Originarios' debe ser menor o igual al Total en control. \",\"\")","v":""},{"$f":"IF($R25>$C25,\"* La celda 'Población Migrantes' debe ser menor o igual al Total en control. \",\"\")","v":""},{"$f":"IF($S25>$C25,\"* La celda 'Personas Viviendo con VIH' debe ser menor o igual al Total en control. \",\"\")","v":""},{"$f":"IF(AND($C25<>0,$Q25=\"\"),\"* No olvide escribir en la celda de 'Pueblos Originarios' (Digite CERO si no tiene). \",\"\")","v":""},{"$f":"IF(AND($C25<>0,$R25=\"\"),\"* No olvide escribir en la celda de 'Población Migrantes' (Digite CERO si no tiene). \",\"\")","v":""},{"$f":"IF(AND($C25<>0,$S25=\"\"),\"* No olvide escribir en la celda de 'PV-VIH' (Digite CERO si no tiene). \",\"\")","v":""},null,null,null,null,null,null,null,null,null,null,null,null,null,null,null,null,null,null,null,null,{"$f":"IF($Q25>$C25,1,0)","v":0},{"$f":"IF($R25>$C25,1,0)","v":0},{"$f":"IF($S25>$C25,1,0)","v":0},{"$f":"IF(AND($C25<>0,$Q25=\"\"),1,0)","v":0},{"$f":"IF(AND($C25<>0,$R25=\"\"),1,0)","v":0},{"$f":"IF(AND($C25<>0,$S25=\"\"),1,0)","v":0}]
["Mujeres con Retiro de Implante Anticipado en el semestre (antes de los 3 años)",null,{"$f":"SUM(D26:P26)","v":0},null,null,null,null,null,null,null,null,null,null,null,null,null,{"$f":"SUM(#REF!)","v":{"$error":"#REF!"}},{"$f":"SUM(#REF!)","v":{"$error":"#REF!"}},{"$f":"SUM(#REF!)","v":{"$error":"#REF!"}},null,null,null,null,null,null,null,null,null,null,null,null,null,null,null,null,null,null,null,null,null,null,null,null,null,null,null,null,null,null,null,null,null,null,null,null,null,null,null,null,null,null,null,null,null,null,null,null,null,null,null,null,null,null,null,null,null,null,null,null,{"$error":"#REF!"},{"$error":"#REF!"},{"$error":"#REF!"},{"$error":"#REF!"},{"$error":"#REF!"},{"$error":"#REF!"},null,null,null,null,null,null,null,null,null,null,null,null,null,null,null,null,null,null,null,null,{"$error":"#REF!"},{"$error":"#REF!"},{"$error":"#REF!"},{"$error":"#REF!"},{"$error":"#REF!"},{"$error":"#REF!"}]
["Mujeres con Retiro de Implante Anticipado en el semestre (antes de los 5 años)",null,{"$f":"SUM(D27:P27)","v":0},null,null,null,null,null,null,null,null,null,null,null,null,null,{"$f":"SUM(#REF!)","v":{"$error":"#REF!"}},{"$f":"SUM(#REF!)","v":{"$error":"#REF!"}},{"$f":"SUM(#REF!)","v":{"$error":"#REF!"}},null,null,null,null,null,null,null,null,null,null,null,null,null,null,null,null,null,null,null,null,null,null,null,null,null,null,null,null,null,null,null,null,null,null,null,null,null,null,null,null,null,null,null,null,null,null,null,null,null,null,null,null,null,null,null,null,null,null,null,null,{"$error":"#REF!"},{"$error":"#REF!"},{"$error":"#REF!"},{"$error":"#REF!"},{"$error":"#REF!"},{"$error":"#REF!"},null,null,null,null,null,null,null,null,null,null,null,null,null,null,null,null,null,null,null,null,{"$error":"#REF!"},{"$error":"#REF!"},{"$error":"#REF!"},{"$error":"#REF!"},{"$error":"#REF!"},{"$error":"#REF!"}]
["Método de Regulación de Fertilidad más Preservativos",null,{"$f":"SUM(D28:P28)","v":0},null,null,null,null,null,null,null,null,null,null,null,null,null,null,null,null,null,null,null,null,null,null,null,null,null,null,null,null,null,null,null,null,null,null,null,null,null,null,null,null,null,null,null,null,null,null,null,null,null,null,null,null,null,null,null,null,null,null,null,null,null,null,null,null,null,null,null,null,null,null,null,null,null,null,null,null,"","","","","","",null,null,null,null,null,null,null,null,null,null,null,null,null,null,null,null,null,null,null,null,0,0,0,0,0,0]
["Gestantes que reciben preservativo",null,{"$f":"SUM(D29:M29)","v":0},null,null,null,null,null,null,null,null,null,null,null,null,null,null,null,null,null,null,null,null,null,null,null,null,null,null,null,null,null,null,null,null,null,null,null,null,null,null,null,null,null,null,null,null,null,null,null,null,null,null,null,null,null,null,null,null,null,null,null,null,null,null,null,null,null,null,null,null,null,null,null,null,null,null,null,null,"","","","","","",null,null,null,null,null,null,null,null,null,null,null,null,null,null,null,null,null,null,null,null,0,0,0,0,0,0]
["PRESERVATIVO/PRACTICA SEXUAL SEGURA","Mujer",{"$f":"SUM(D30:P30)","v":0},null,null,null,null,null,null,null,null,null,null,null,null,null,null,null,null,null,null,null,null,null,null,null,null,null,null,null,null,null,null,null,null,null,null,null,null,null,null,null,null,null,null,null,null,null,null,null,null,null,null,null,null,null,null,null,null,null,null,null,null,null,null,null,null,null,null,null,null,null,null,null,null,null,null,null,null,"","","","","","",null,null,null,null,null,null,null,null,null,null,null,null,null,null,null,null,null,null,null,null,0,0,0,0,0,0]
[null,"Hombres",{"$f":"SUM(D31:P31)","v":0},null,null,null,null,null,null,null,null,null,null,null,null,null,null,null,null,null,null,null,null,null,null,null,null,null,null,null,null,null,null,null,null,null,null,null,null,null,null,null,null,null,null,null,null,null,null,null,null,null,null,null,null,null,null,null,null,null,null,null,null,null,null,null,null,null,null,null,null,null,null,null,null,null,null,null,null,"","","","","","",null,null,null,null,null,null,null,null,null,null,null,null,null,null,null,null,null,null,null,null,0,0,0,0,0,0]
["LUBRICANTES","Mujer",{"$f":"SUM(D32:P32)","v":0},null,null,null,null,null,null,null,null,null,null,null,null,null,null,null,null,null,null,null,null,null,null,null,null,null,null,null,null,null,null,null,null,null,null,null,null,null,null,null,null,null,null,null,null,null,null,null,null,null,null,null,null,null,null,null,null,null,null,null,null,null,null,null,null,null,null,null,null,null,null,null,null,null,null,null,null,"","","","","","",null,null,null,null,null,null,null,null,null,null,null,null,null,null,null,null,null,null,null,null,0,0,0,0,0,0]
[null,"Hombres",{"$f":"SUM(D33:P33)","v":0},null,null,null,null,null,null,null,null,null,null,null,null,null,null,null,null,null,null,null,null,null,null,null,null,null,null,null,null,null,null,null,null,null,null,null,null,null,null,null,null,null,null,null,null,null,null,null,null,null,null,null,null,null,null,null,null,null,null,null,null,null,null,null,null,null,null,null,null,null,null,null,null,null,null,null,null,"","","","","","",null,null,null,null,null,null,null,null,null,null,null,null,null,null,null,null,null,null,null,null,0,0,0,0,0,0]
["CONDON FEMENINO",null,{"$f":"SUM(D34:P34)","v":0},null,null,null,null,null,null,null,null,null,null,null,null,null,null,null,null,null,null,null,null,null,null,null,null,null,null,null,null,null,null,null,null,null,null,null,null,null,null,null,null,null,null,null,null,null,null,null,null,null,null,null,null,null,null,null,null,null,null,null,null,null,null,null,null,null,null,null,null,null,null,null,null,null,null,null,null,"","","","","","",null,null,null,null,null,null,null,null,null,null,null,null,null,null,null,null,null,null,null,null,0,0,0,0,0,0]
["SECCION B: GESTANTES EN CONTROL CON EVALUACIÓN RIESGO BIOPSICOSOCIAL "]
["GRUPOS DE EDAD","TOTAL DE GESTANTES EN CONTROL","EN RIESGO \nPSICO-\nSOCIAL","QUE PRESENTAN VIOLENCIA DE GÉNERO","GESTANTES QUE PRESENTAN ARO","POBLACION MIGRANTES"]
[]
["Menos de 15 años",null,null,null,null,null,{"$f":"($CA38&$CB38&$CC38&$CD38&$CE38&$CF38&$CG38&$CH38&$CI38&$CJ38&$CL38&$CM38&$CN38&$CO38&$CP38&$CQ38&$CR38&$CS38&$CT38&$CU38&$CV38&$CW38&$CX38&$CY38&$CZ38)","v":""},null,null,null,null,null,null,null,null,null,null,null,null,null,null,null,null,null,null,null,null,null,null,null,null,null,null,null,null,null,null,null,null,null,null,null,null,null,null,null,null,null,null,null,null,null,null,null,null,null,null,null,null,null,null,null,null,null,null,null,null,null,null,null,null,null,null,null,null,null,null,null,{"$f":"IF($C38<$D38,\"* Las Gestantes Menores de 15 años con violencia de género deben estar incluidas en las Gestantes con riesgo psicosocial. \",\"\")","v":""},{"$f":"IF($B38<$C38,\"* Las Gestantes Menores de 15 años con Riesgo Psicosocial deben estar incluidas en el Total de Gestantes en Control misma edad. \",\"\")","v":""},{"$f":"IF($B38<$E38,\"* Las Gestantes Menores de 15 años que presentan ARO deben estar incluidas en el Total de Gestantes en Control misma edad. \",\"\")","v":""},{"$f":"IF($B38<$F38,\"* Las Gestantes Menores de 15 años que pertenecen a 'Población Migrantes' deben estar incluidas en el Total de Gestantes en Control misma edad. \",\"\")","v":""},null,{"$f":"IF(AND(B38<>0,F38=\"\"),\"* No olvide escribir en la celda de 'Población Migrantes' (Digite CERO si no tiene). \",\"\")","v":""},null,null,null,null,null,null,null,null,null,null,null,null,null,null,null,null,null,null,null,null,{"$f":"IF($C38<$D38,1,0)","v":0},{"$f":"IF($B38<$C38,1,0)","v":0},{"$f":"IF($B38<$E38,1,0)","v":0},{"$f":"IF($B38<$F38,1,0)","v":0},null,{"$f":"IF(AND(B38<>0,F38=\"\"),1,0)","v":0}]
["15 a 19 años",null,null,null,null,null,"",null,null,null,null,null,null,null,null,null,null,null,null,null,null,null,null,null,null,null,null,null,null,null,null,null,null,null,null,null,null,null,null,null,null,null,null,null,null,null,null,null,null,null,null,null,null,null,null,null,null,null,null,null,null,null,null,null,null,null,null,null,null,null,null,null,null,null,null,null,null,null,{"$f":"IF($C39<$D39,\"* Las Gestantes de 15 a 19 años con violencia de género deben estar incluidas en las Gestantes con riesgo psicosocial. \",\"\")","v":""},{"$f":"IF($B39<$C39,\"* Las Gestantes de 15 a 19 años con Riesgo Psicosocial deben estar incluidas en el Total de Gestantes en Control misma edad. \",\"\")","v":""},{"$f":"IF($B39<$E39,\"* Las Gestantes de 15 a 19 años que presentan ARO deben estar incluidas en el Total de Gestantes en Control misma edad. \",\"\")","v":""},{"$f":"IF($B39<$F39,\"* Las Gestantes de 15 a 19 años que pertenecen a 'Población Migrantes' deben estar incluidas en el Total de Gestantes en Control misma edad. \",\"\")","v":""},null,"",null,null,null,null,null,null,null,null,null,null,null,null,null,null,null,null,null,null,null,null,0,0,0,0,null,0]
["20 a 24 años",null,null,null,null,null,"",null,null,null,null,null,null,null,null,null,null,null,null,null,null,null,null,null,null,null,null,null,null,null,null,null,null,null,null,null,null,null,null,null,null,null,null,null,null,null,null,null,null,null,null,null,null,null,null,null,null,null,null,null,null,null,null,null,null,null,null,null,null,null,null,null,null,null,null,null,null,null,{"$f":"IF($C40<$D40,\"* Las Gestantes de 20 a 24 años con violencia de género deben estar incluidas en las Gestantes con riesgo psicosocial. \",\"\")","v":""},{"$f":"IF($B40<$C40,\"* Las Gestantes de 20 a 24 años con Riesgo Psicosocial deben estar incluidas en el Total de Gestantes en Control misma edad. \",\"\")","v":""},{"$f":"IF($B40<$E40,\"* Las Gestantes de 20 a 24 años que presentan ARO deben estar incluidas en el Total de Gestantes en Control misma edad. \",\"\")","v":""},{"$f":"IF($B40<$F40,\"* Las Gestantes de 20 a 24 años que pertenecen a 'Población Migrantes' deben estar incluidas en el Total de Gestantes en Control misma edad. \",\"\")","v":""},null,"",null,null,null,null,null,null,null,null,null,null,null,null,null,null,null,null,null,null,null,null,0,0,0,0,null,0]
["25 a 29 años",null,null,null,null,null,"",null,null,null,null,null,null,null,null,null,null,null,null,null,null,null,null,null,null,null,null,null,null,null,null,null,null,null,null,null,null,null,null,null,null,null,null,null,null,null,null,null,null,null,null,null,null,null,null,null,null,null,null,null,null,null,null,null,null,null,null,null,null,null,null,null,null,null,null,null,null,null,{"$f":"IF($C41<$D41,\"* Las Gestantes de 25 a 29 años con violencia de género deben estar incluidas en las Gestantes con riesgo psicosocial. \",\"\")","v":""},{"$f":"IF($B41<$C41,\"* Las Gestantes de 25 a 29 años con Riesgo Psicosocial deben estar incluidas en el Total de Gestantes en Control misma edad. \",\"\")","v":""},{"$f":"IF($B41<$E41,\"* Las Gestantes de 25 a 29 años que presentan ARO deben estar incluidas en el Total de Gestantes en Control misma edad. \",\"\")","v":""},{"$f":"IF($B41<$F41,\"* Las Gestantes de 25 a 29 años que pertenecen a 'Población Migrantes' deben estar incluidas en el Total de Gestantes en Control misma edad. \",\"\")","v":""},null,"",null,null,null,null,null,null,null,null,null,null,null,null,null,null,null,null,null,null,null,null,0,0,0,0,null,0]
["30 a 34 años",null,null,null,null,null,"",null,null,null,null,null,null,null,null,null,null,null,null,null,null,null,null,null,null,null,null,null,null,null,null,null,null,null,null,null,null,null,null,null,null,null,null,null,null,null,null,null,null,null,null,null,null,null,null,null,null,null,null,null,null,null,null,null,null,null,null,null,null,null,null,null,null,null,null,null,null,null,{"$f":"IF($C42<$D42,\"* Las Gestantes de 30 a 34 años con violencia de género deben estar incluidas en las Gestantes con riesgo psicosocial. \",\"\")","v":""},{"$f":"IF($B42<$C42,\"* Las Gestantes de 30 a 34 años con Riesgo Psicosocial deben estar incluidas en el Total de Gestantes en Control misma edad. \",\"\")","v":""},{"$f":"IF($B42<$E42,\"* Las Gestantes de 30 a 34 años que presentan ARO deben estar incluidas en el Total de Gestantes en Control misma edad. \",\"\")","v":""},{"$f":"IF($B42<$F42,\"* Las Gestantes de 30 a 34 años que pertenecen a 'Población Migrantes' deben estar incluidas en el Total de Gestantes en Control misma edad. \",\"\")","v":""},null,"",null,null,null,null,null,null,null,null,null,null,null,null,null,null,null,null,null,null,null,null,0,0,0,0,null,0]
["35 a 39 años",null,null,null,null,null,"",null,null,null,null,null,null,null,null,null,null,null,null,null,null,null,null,null,null,null,null,null,null,null,null,null,null,null,null,null,null,null,null,null,null,null,null,null,null,null,null,null,null,null,null,null,null,null,null,null,null,null,null,null,null,null,null,null,null,null,null,null,null,null,null,null,null,null,null,null,null,null,{"$f":"IF($C43<$D43,\"* Las Gestantes de 35 a 39 años con violencia de género deben estar incluidas en las Gestantes con riesgo psicosocial. \",\"\")","v":""},{"$f":"IF($B43<$C43,\"* Las Gestantes de 35 a 39 años con Riesgo Psicosocial deben estar incluidas en el Total de Gestantes en Control misma edad. \",\"\")","v":""},{"$f":"IF($B43<$E43,\"* Las Gestantes de 35 a 39 años que presentan ARO deben estar incluidas en el Total de Gestantes en Control misma edad. \",\"\")","v":""},{"$f":"IF($B43<$F43,\"* Las Gestantes de 35 a 39 años que pertenecen a 'Población Migrantes' deben estar incluidas en el Total de Gestantes en Control misma edad. \",\"\")","v":""},null,"",null,null,null,null,null,null,null,null,null,null,null,null,null,null,null,null,null,null,null,null,0,0,0,0,null,0]
["40 a 44 años",null,null,null,null,null,"",null,null,null,null,null,null,null,null,null,null,null,null,null,null,null,null,null,null,null,null,null,null,null,null,null,null,null,null,null,null,null,null,null,null,null,null,null,null,null,null,null,null,null,null,null,null,null,null,null,null,null,null,null,null,null,null,null,null,null,null,null,null,null,null,null,null,null,null,null,null,null,{"$f":"IF($C44<$D44,\"* Las Gestantes de 40 a 44 años con violencia de género deben estar incluidas en las Gestantes con riesgo psicosocial. \",\"\")","v":""},{"$f":"IF($B44<$C44,\"* Las Gestantes de 40 a 44 años con Riesgo Psicosocial deben estar incluidas en el Total de Gestantes en Control misma edad. \",\"\")","v":""},{"$f":"IF($B44<$E44,\"* Las Gestantes de 40 a 44 años que presentan ARO deben estar incluidas en el Total de Gestantes en Control misma edad. \",\"\")","v":""},{"$f":"IF($B44<$F44,\"* Las Gestantes de 40 a 44 años que pertenecen a 'Población Migrantes' deben estar incluidas en el Total de Gestantes en Control misma edad. \",\"\")","v":""},null,"",null,null,null,null,null,null,null,null,null,null,null,null,null,null,null,null,null,null,null,null,0,0,0,0,null,0]
["45 a 49 años",null,null,null,null,null,"",null,null,null,null,null,null,null,null,null,null,null,null,null,null,null,null,null,null,null,null,null,null,null,null,null,null,null,null,null,null,null,null,null,null,null,null,null,null,null,null,null,null,null,null,null,null,null,null,null,null,null,null,null,null,null,null,null,null,null,null,null,null,null,null,null,null,null,null,null,null,null,{"$f":"IF($C45<$D45,\"* Las Gestantes de 45 a 49 años con violencia de género deben estar incluidas en las Gestantes con riesgo psicosocial. \",\"\")","v":""},{"$f":"IF($B45<$C45,\"* Las Gestantes de 45 a 49 años con Riesgo Psicosocial deben estar incluidas en el Total de Gestantes en Control misma edad. \",\"\")","v":""},{"$f":"IF($B45<$E45,\"* Las Gestantes de 45 a 49 años que presentan ARO deben estar incluidas en el Total de Gestantes en Control misma edad. \",\"\")","v":""},{"$f":"IF($B45<$F45,\"* Las Gestantes de 45 a 49 años que pertenecen a 'Población Migrantes' deben estar incluidas en el Total de Gestantes en Control misma edad. \",\"\")","v":""},null,"",null,null,null,null,null,null,null,null,null,null,null,null,null,null,null,null,null,null,null,null,0,0,0,0,null,0]
["50 a 54 años",null,null,null,null,null,"",null,null,null,null,null,null,null,null,null,null,null,null,null,null,null,null,null,null,null,null,null,null,null,null,null,null,null,null,null,null,null,null,null,null,null,null,null,null,null,null,null,null,null,null,null,null,null,null,null,null,null,null,null,null,null,null,null,null,null,null,null,null,null,null,null,null,null,null,null,null,null,{"$f":"IF($C46<$D46,\"* Las Gestantes de 50 a 54 años con violencia de género deben estar incluidas en las Gestantes con riesgo psicosocial. \",\"\")","v":""},{"$f":"IF($B46<$C46,\"* Las Gestantes de 50 a 54 años con Riesgo Psicosocial deben estar incluidas en el Total de Gestantes en Control misma edad. \",\"\")","v":""},{"$f":"IF($B46<$E46,\"* Las Gestantes de 50 a 54 años que presentan ARO deben estar incluidas en el Total de Gestantes en Control misma edad. \",\"\")","v":""},{"$f":"IF($B46<$F46,\"* Las Gestantes de 50 a 54 años que pertenecen a 'Población Migrantes' deben estar incluidas en el Total de Gestantes en Control misma edad. \",\"\")","v":""},null,"",null,null,null,null,null,null,null,null,null,null,null,null,null,null,null,null,null,null,null,null,0,0,0,0,null,0]
["TOTAL",{"$f":"SUM(B38:B46)","v":0},{"$f":"SUM(C38:C46)","v":0},{"$f":"SUM(D38:D46)","v":0},{"$f":"SUM(E38:E46)","v":0},{"$f":"SUM(F38:F46)","v":0}]
["SECCION C: GESTANTES EN RIESGO PSICOSOCIAL CON VISITA DOMICILIARIA INTEGRAL REALIZADA "]
["N° VDI","N° Gestantes \ncon VDI","TOTAL de Visitas"]
[]
["1 Visita",null,{"$f":"B51*1","v":0},{"$f":"($CA51&$CB51&$CC51&$CD51&$CE51&$CF51&$CG51&$CH51&$CI51&$CJ51&$CL51&$CM51&$CN51&$CO51&$CP51&$CQ51&$CR51&$CS51&$CT51&$CU51&$CV51&$CW51&$CX51&$CY51&$CZ51)","v":""},null,null,null,null,null,null,null,null,null,null,null,null,null,null,null,null,null,null,null,null,null,null,null,null,null,null,null,null,null,null,null,null,null,null,null,null,null,null,null,null,null,null,null,null,null,null,null,null,null,null,null,null,null,null,null,null,null,null,null,null,null,null,null,null,null,null,null,null,null,null,null,null,null,null,{"$f":"IF($C$51<>$B$51*1,\"* NO ALTERE LAS FÓRMULAS, el Total de Visitas equivale a 1 visita por gestante. \",\"\")","v":""},null,null,null,null,null,null,null,null,null,null,null,null,null,null,null,null,null,null,null,null,null,null,null,null,null,{"$f":"IF($C$51<>$B$51*1,1,0)","v":0}]
["2 Visitas",null,{"$f":"B52*2","v":0},{"$f":"($CA52&$CB52&$CC52&$CD52&$CE52&$CF52&$CG52&$CH52&$CI52&$CJ52&$CL52&$CM52&$CN52&$CO52&$CP52&$CQ52&$CR52&$CS52&$CT52&$CU52&$CV52&$CW52&$CX52&$CY52&$CZ52)","v":""},null,null,null,null,null,null,null,null,null,null,null,null,null,null,null,null,null,null,null,null,null,null,null,null,null,null,null,null,null,null,null,null,null,null,null,null,null,null,null,null,null,null,null,null,null,null,null,null,null,null,null,null,null,null,null,null,null,null,null,null,null,null,null,null,null,null,null,null,null,null,null,null,null,null,{"$f":"IF($C$52<>$B$52*2,\"* NO ALTERE LAS FÓRMULAS, el Total de Visitas equivale a 2 visitas por gestante. \",\"\")","v":""},null,null,null,null,null,null,null,null,null,null,null,null,null,null,null,null,null,null,null,null,null,null,null,null,null,{"$f":"IF($C$52<>$B$52*2,1,0)","v":0}]
["3 Visitas",null,{"$f":"B53*3","v":0},{"$f":"($CA53&$CB53&$CC53&$CD53&$CE53&$CF53&$CG53&$CH53&$CI53&$CJ53&$CL53&$CM53&$CN53&$CO53&$CP53&$CQ53&$CR53&$CS53&$CT53&$CU53&$CV53&$CW53&$CX53&$CY53&$CZ53)","v":""},null,null,null,null,null,null,null,null,null,null,null,null,null,null,null,null,null,null,null,null,null,null,null,null,null,null,null,null,null,null,null,null,null,null,null,null,null,null,null,null,null,null,null,null,null,null,null,null,null,null,null,null,null,null,null,null,null,null,null,null,null,null,null,null,null,null,null,null,null,null,null,null,null,null,{"$f":"IF($C$53<>$B$53*3,\"* NO ALTERE LAS FÓRMULAS, el Total de Visitas equivale a 3 visitas por gestante. \",\"\")","v":""},null,null,null,null,null,null,null,null,null,null,null,null,null,null,null,null,null,null,null,null,null,null,null,null,null,{"$f":"IF($C$53<>$B$53*3,1,0)","v":0}]
["4 y más visitas",null,null,{"$f":"($CA54&$CB54&$CC54&$CD54&$CE54&$CF54&$CG54&$CH54&$CI54&$CJ54&$CL54&$CM54&$CN54&$CO54&$CP54&$CQ54&$CR54&$CS54&$CT54&$CU54&$CV54&$CW54&$CX54&$CY54&$CZ54)","v":""}]
["TOTAL",{"$f":"SUM(B51:B54)","v":0},{"$f":"SUM(C51:C54)","v":0}]
["SECCION D: GESTANTES Y MUJERES DE 8° MES POST-PARTO EN CONTROL, SEGÚN ESTADO NUTRICIONAL"]
["POBLACION","ESTADO\nNUTRICIONAL","TOTAL","GRUPOS DE EDAD (en años)"]
[null,null,null,"Menos 15 años","15 a 19 años","20 a 24 años","25 a 29 años","30 a 34 años","35 a 39 años","40 a 44 años","45 a 49 años","50 a 54 años"]
["GESTANTES EN CONTROL\n(Información a la fecha de corte)","OBESA",{"$f":"SUM(D59:L59)","v":0},null,null,null,null,null,null,null,null,null,{"$f":"($CA59&$CB59&$CC59&$CD59&$CE59&$CF59&$CG59&$CH59&$CI59&$CJ59&$CL59&$CM59&$CN59&$CO59&$CP59&$CQ59&$CR59&$CS59&$CT59&$CU59&$CV59&$CW59&$CX59&$CY59&$CZ59)","v":""}]
[null,"SOBREPESO",{"$f":"SUM(D60:L60)","v":0},null,null,null,null,null,null,null,null,null,""]
[null,"NORMAL",{"$f":"SUM(D61:L61)","v":0},null,null,null,null,null,null,null,null,null,""]
[null,"BAJO PESO",0,null,null,null,null,null,null,null,null,null,""]
[null,"TOTAL",{"$f":"SUM(D63:L63)","v":0},{"$f":"SUM(D59:D62)","v":0},{"$f":"SUM(E59:E62)","v":0},0,0,0,0,0,0,0,{"$f":" CA63 & CB63 & CC63 & CD63 & CE63 & CF63 & CG63 & CH63 & CI63","v":""},null,null,null,null,null,null,null,null,null,null,null,null,null,null,null,null,null,null,null,null,null,null,null,null,null,null,null,null,null,null,null,null,null,null,null,null,null,null,null,null,null,null,null,null,null,null,null,null,null,null,null,null,null,null,null,null,null,null,null,null,null,null,null,null,null,{"$f":"IF($B$38<>$D63,\"* Las Gestantes Menores de 15 años, según Estado Nutricional debe ser igual al Total de gestantes en Control de esa edad en Sección B. \",\"\")","v":""},{"$f":"IF($B$39<>$E63,\"* Las gestantes 15-19 años, según Estado Nutricional debe ser igual al Total de gestantes en Control de esa edad en Sección B. \",\"\")","v":""},{"$f":"IF($B$40<>$F63,\"* Las gestantes20-24 años, según Estado Nutricional debe ser igual al Total de gestantes en Control de esa edad en Sección B. \",\"\")","v":""},{"$f":"IF($B$41<>$G63,\"* Las gestantes 25-29 años, según Estado Nutricional debe ser igual al Total de gestantes en Control de esa edad en Sección B. \",\"\")","v":""},{"$f":"IF($B$42<>$H63,\"* Las gestantes30-34 años, según Estado Nutricional debe ser igual al Total de gestantes en Control de esa edad en Sección B. \",\"\")","v":""},{"$f":"IF($B$43<>$I63,\"* Las gestantes 35-39 años, según Estado Nutricional debe ser igual al Total de gestantes en Control de esa edad en Sección B. \",\"\")","v":""},{"$f":"IF($B$44<>$J63,\"* Las gestantes 40-44 años, según Estado Nutricional debe ser igual al Total de gestantes en Control de esa edad en Sección B. \",\"\")","v":""},{"$f":"IF($B$45<>$K63,\"* Las gestantes 45-49 años, según Estado Nutricional debe ser igual al Total de gestantes en Control de esa edad en Sección B. \",\"\")","v":""},{"$f":"IF($B$46<>$L63,\"* Las gestantes 50-54 años, según Estado Nutricional debe ser igual al Total de gestantes en Control de esa edad en Sección B. \",\"\")","v":""},null,null,null,null,null,null,null,null,null,null,null,null,null,null,null,null,null,{"$f":"IF($B$38<>$D63,1,0)","v":0},{"$f":"IF($B$39<>$E63,1,0)","v":0},{"$f":"IF($B$40<>$F63,1,0)","v":0},{"$f":"IF($B$41<>$G63,1,0)","v":0},{"$f":"IF($B$42<>$H63,1,0)","v":0},{"$f":"IF($B$43<>$I63,1,0)","v":0},{"$f":"IF($B$44<>$J63,1,0)","v":0},{"$f":"IF($B$45<>$K63,1,0)","v":0},{"$f":"IF($B$46<>$L63,1,0)","v":0}]
["CONTROL AL 8º MES POST-PARTO\n(Información del semestre)","OBESA",0,null,null,null,null,null,null,null,null,null,""]
[null,"SOBREPESO",0,null,null,null,null,null,null,null,null,null,""]
[null,"NORMAL",0,null,null,null,null,null,null,null,null,null,""]
[null,"BAJO PESO",0,null,null,null,null,null,null,null,null,null,""]
[null,"TOTAL",{"$f":"SUM(D68:L68)","v":0},{"$f":"SUM(D64:D67)","v":0},{"$f":"SUM(E64:E67)","v":0},{"$f":"SUM(F64:F67)","v":0},{"$f":"SUM(G64:G67)","v":0},0,0,{"$f":"SUM(J64:J67)","v":0},0,0]
["SECCION E: MUJERES Y GESTANTES EN CONTROL CON CONSULTA NUTRICIONAL "]
["MUJERES","TOTAL"]
["Gestantes con malnutrición por déficit (bajo peso)",null,{"$f":"($CA71&$CB71&$CC71&$CD71&$CE71&$CF71&$CG71&$CH71&$CI71&$CJ71&$CL71&$CM71&$CN71&$CO71&$CP71&$CQ71&$CR71&$CS71&$CT71&$CU71&$CV71&$CW71&$CX71&$CY71&$CZ71)","v":""},null,null,null,null,null,null,null,null,null,null,null,null,null,null,null,null,null,null,null,null,null,null,null,null,null,null,null,null,null,null,null,null,null,null,null,null,null,null,null,null,null,null,null,null,null,null,null,null,null,null,null,null,null,null,null,null,null,null,null,null,null,null,null,null,null,null,null,null,null,null,null,null,null,null,null,{"$f":"IF($B$71<=$C$62,\"\",\"* Gestantes malnutricion no debe ser mayor que Gestantes en Control Bajo Peso (Seccion D). \")","v":""},null,null,null,null,null,null,null,null,null,null,null,null,null,null,null,null,null,null,null,null,null,null,null,null,null,{"$f":"IF($B$71<=$C$62,0,1)","v":0}]
["Gestantes con malnutrición por exceso - Obesa",null,{"$f":"($CA72&$CB72&$CC72&$CD72&$CE72&$CF72&$CG72&$CH72&$CI72&$CJ72&$CL72&$CM72&$CN72&$CO72&$CP72&$CQ72&$CR72&$CS72&$CT72&$CU72&$CV72&$CW72&$CX72&$CY72&$CZ72)","v":""},null,null,null,null,null,null,null,null,null,null,null,null,null,null,null,null,null,null,null,null,null,null,null,null,null,null,null,null,null,null,null,null,null,null,null,null,null,null,null,null,null,null,null,null,null,null,null,null,null,null,null,null,null,null,null,null,null,null,null,null,null,null,null,null,null,null,null,null,null,null,null,null,null,null,null,{"$f":"IF($B$72<=$C$59,\"\",\"* Gestantes malnutricion no debe ser mayor que Gestantes en Control Obesa (Seccion D). \")","v":""},null,null,null,null,null,null,null,null,null,null,null,null,null,null,null,null,null,null,null,null,null,null,null,null,null,{"$f":"IF($B$72<=$C$59,0,1)","v":0}]
["Gestantes con malnutrición por exceso - Sobrepeso",null,{"$f":"($CA73&$CB73&$CC73&$CD73&$CE73&$CF73&$CG73&$CH73&$CI73&$CJ73&$CL73&$CM73&$CN73&$CO73&$CP73&$CQ73&$CR73&$CS73&$CT73&$CU73&$CV73&$CW73&$CX73&$CY73&$CZ73)","v":""},null,null,null,null,null,null,null,null,null,null,null,null,null,null,null,null,null,null,null,null,null,null,null,null,null,null,null,null,null,null,null,null,null,null,null,null,null,null,null,null,null,null,null,null,null,null,null,null,null,null,null,null,null,null,null,null,null,null,null,null,null,null,null,null,null,null,null,null,null,null,null,null,null,null,null,{"$f":"IF($B$73<=$C$60,\"\",\"* Gestantes malnutricion no debe ser mayor que Gestantes en Control Sobrepeso (Seccion D). \")","v":""},null,null,null,null,null,null,null,null,null,null,null,null,null,null,null,null,null,null,null,null,null,null,null,null,null,{"$f":"IF($B$73<=$C$60,0,1)","v":0}]
["En 3º mes post parto",null,{"$f":"($CA74&$CB74&$CC74&$CD74&$CE74&$CF74&$CG74&$CH74&$CI74&$CJ74&$CL74&$CM74&$CN74&$CO74&$CP74&$CQ74&$CR74&$CS74&$CT74&$CU74&$CV74&$CW74&$CX74&$CY74&$CZ74)","v":""}]
["En 6º mes post parto",null,{"$f":"($CA75&$CB75&$CC75&$CD75&$CE75&$CF75&$CG75&$CH75&$CI75&$CJ75&$CL75&$CM75&$CN75&$CO75&$CP75&$CQ75&$CR75&$CS75&$CT75&$CU75&$CV75&$CW75&$CX75&$CY75&$CZ75)","v":""}]
["SECCION F: MUJERES EN CONTROL DE CLIMATERIO "]
["Población","45 a 64 años"]
["Población en Control",null,{"$f":"($CA78&$CB78&$CC78&$CD78&$CE78&$CF78&$CG78&$CH78&$CI78&$CJ78&$CL78&$CM78&$CN78&$CO78&$CP78&$CQ78&$CR78&$CS78&$CT78&$CU78&$CV78&$CW78&$CX78&$CY78&$CZ78)","v":""}]
["Mujeres con pauta aplicada MRS*",null,{"$f":"($CA79&$CB79&$CC79&$CD79&$CE79&$CF79&$CG79&$CH79&$CI79&$CJ79&$CL79&$CM79&$CN79&$CO79&$CP79&$CQ79&$CR79&$CS79&$CT79&$CU79&$CV79&$CW79&$CX79&$CY79&$CZ79)","v":""},null,null,null,null,null,null,null,null,null,null,null,null,null,null,null,null,null,null,null,null,null,null,null,null,null,null,null,null,null,null,null,null,null,null,null,null,null,null,null,null,null,null,null,null,null,null,null,null,null,null,null,null,null,null,null,null,null,null,null,null,null,null,null,null,null,null,null,null,null,null,null,null,null,null,null,{"$f":"IF($B79>$B78,\"* El Nº de mujeres con pauta aplicada MRS no debe ser mayor a la población de mujeres en control por climaterio. \",\"\")","v":""},null,null,null,null,null,null,null,null,null,null,null,null,null,null,null,null,null,null,null,null,null,null,null,null,null,{"$f":"IF($B79>$B78,1,0)","v":0}]
["Mujeres con MRS elevado*",null,{"$f":"($CA80&$CB80&$CC80&$CD80&$CE80&$CF80&$CG80&$CH80&$CI80&$CJ80&$CL80&$CM80&$CN80&$CO80&$CP80&$CQ80&$CR80&$CS80&$CT80&$CU80&$CV80&$CW80&$CX80&$CY80&$CZ80)","v":""},null,null,null,null,null,null,null,null,null,null,null,null,null,null,null,null,null,null,null,null,null,null,null,null,null,null,null,null,null,null,null,null,null,null,null,null,null,null,null,null,null,null,null,null,null,null,null,null,null,null,null,null,null,null,null,null,null,null,null,null,null,null,null,null,null,null,null,null,null,null,null,null,null,null,null,{"$f":"IF($B80>$B79,\"* El Nº de mujeres con puntaje elevado de MRS no debe ser mayor al Nº de mujeres con pauta aplicada MRS. \",\"\")","v":""},null,null,null,null,null,null,null,null,null,null,null,null,null,null,null,null,null,null,null,null,null,null,null,null,null,{"$f":"IF($B80>$B79,1,0)","v":0}]
["Mujeres con aplicación de terapia hormonal de reemplazo según MRS*",null,{"$f":"($CA81&$CB81&$CC81&$CD81&$CE81&$CF81&$CG81&$CH81&$CI81&$CJ81&$CL81&$CM81&$CN81&$CO81&$CP81&$CQ81&$CR81&$CS81&$CT81&$CU81&$CV81&$CW81&$CX81&$CY81&$CZ81)","v":""},null,null,null,null,null,null,null,null,null,null,null,null,null,null,null,null,null,null,null,null,null,null,null,null,null,null,null,null,null,null,null,null,null,null,null,null,null,null,null,null,null,null,null,null,null,null,null,null,null,null,null,null,null,null,null,null,null,null,null,null,null,null,null,null,null,null,null,null,null,null,null,null,null,null,null,{"$f":"IF($B81>$B80,\"* El Nº de mujeres con aplicación de terapia hormonal de reemplazo según MRS no debe ser mayor que el numero de mujeres con puntaje elevado de MRS. \",\"\")","v":""},null,null,null,null,null,null,null,null,null,null,null,null,null,null,null,null,null,null,null,null,null,null,null,null,null,{"$f":"IF($B81>$B80,1,0)","v":0}]
["Mujeres que asisten a Talleres Educativos",null,{"$f":"($CA82&$CB82&$CC82&$CD82&$CE82&$CF82&$CG82&$CH82&$CI82&$CJ82&$CL82&$CM82&$CN82&$CO82&$CP82&$CQ82&$CR82&$CS82&$CT82&$CU82&$CV82&$CW82&$CX82&$CY82&$CZ82)","v":""}]
["* MRS: Menopause Rating Scale"]
["SECCION F.1: POBLACIÓN EN CONTROL CLIMATERIO SEGÚN TIPO TERAPIA REEMPLAZO HORMONAL"]
["MÉTODOS",null,"TOTAL","GRUPO DE EDAD (en años)",null,null,null,null,"Pueblos Originarios","Población Migrantes"]
[null,null,null,"Menor \nde 45 años","45 a 49 años","50 a 54 años","55 a 60 años","60 a 64 años"]
["Estradiol Micronizado 1mg",null,{"$f":"SUM(D87:H87)","v":0},null,null,null,null,null,null,null,{"$f":"($CA87&$CB87&$CC87&$CD87&$CE87&$CF87&$CG87&$CH87&$CI87&$CJ87&$CL87&$CM87&$CN87&$CO87&$CP87&$CQ87&$CR87&$CS87&$CT87&$CU87&$CV87&$CW87&$CX87&$CY87&$CZ87)","v":""},null,null,null,null,null,null,null,null,null,null,null,null,null,null,null,null,null,null,null,null,null,null,null,null,null,null,null,null,null,null,null,null,null,null,null,null,null,null,null,null,null,null,null,null,null,null,null,null,null,null,null,null,null,null,null,null,null,null,null,null,null,null,null,null,null,null,null,{"$f":"IF($I87>$C87,\"* La celda 'Pueblos Originarios' debe ser menor o igual al Total en control. \",\"\")","v":""},{"$f":"IF($J87>$C87,\"* La celda 'Población Migrantes' debe ser menor o igual al Total en control. \",\"\")","v":""},{"$f":"IF(AND($C87<>0,$I87=\"\"),\"* No olvide escribir en la celda de 'Pueblos Originarios' (Digite CERO si no tiene). \",\"\")","v":""},{"$f":"IF(AND($C87<>0,$J87=\"\"),\"* No olvide escribir en la celda de 'Población Migrantes' (Digite CERO si no tiene). \",\"\")","v":""},null,null,null,null,null,null,null,null,null,null,null,null,null,null,null,null,null,null,null,null,null,null,{"$f":"IF($I87>$C87,1,0)","v":0},{"$f":"IF($J87>$C87,1,0)","v":0},{"$f":"IF(AND($C87<>0,$I87=\"\"),1,0)","v":0},{"$f":"IF(AND($C87<>0,$J87=\"\"),1,0)","v":0}]
["Estradiol Gel",null,{"$f":"SUM(D88:H88)","v":0},null,null,null,null,null,null,null,"",null,null,null,null,null,null,null,null,null,null,null,null,null,null,null,null,null,null,null,null,null,null,null,null,null,null,null,null,null,null,null,null,null,null,null,null,null,null,null,null,null,null,null,null,null,null,null,null,null,null,null,null,null,null,null,null,null,null,null,null,null,null,null,null,null,null,null,"","","","",null,null,null,null,null,null,null,null,null,null,null,null,null,null,null,null,null,null,null,null,null,null,0,0,0,0]
["Progesterona Micronizada 100mg",null,{"$f":"SUM(D89:H89)","v":0},null,null,null,null,null,null,null,"",null,null,null,null,null,null,null,null,null,null,null,null,null,null,null,null,null,null,null,null,null,null,null,null,null,null,null,null,null,null,null,null,null,null,null,null,null,null,null,null,null,null,null,null,null,null,null,null,null,null,null,null,null,null,null,null,null,null,null,null,null,null,null,null,null,null,null,"","","","",null,null,null,null,null,null,null,null,null,null,null,null,null,null,null,null,null,null,null,null,null,null,0,0,0,0]
["Progesterona Micronizada 200mg",null,{"$f":"SUM(D90:H90)","v":0},null,null,null,null,null,null,null,"",null,null,null,null,null,null,null,null,null,null,null,null,null,null,null,null,null,null,null,null,null,null,null,null,null,null,null,null,null,null,null,null,null,null,null,null,null,null,null,null,null,null,null,null,null,null,null,null,null,null,null,null,null,null,null,null,null,null,null,null,null,null,null,null,null,null,null,"","","","",null,null,null,null,null,null,null,null,null,null,null,null,null,null,null,null,null,null,null,null,null,null,0,0,0,0]
["Nomegestrol 5mg comp.",null,0,null,null,null,null,null,null,null,"",null,null,null,null,null,null,null,null,null,null,null,null,null,null,null,null,null,null,null,null,null,null,null,null,null,null,null,null,null,null,null,null,null,null,null,null,null,null,null,null,null,null,null,null,null,null,null,null,null,null,null,null,null,null,null,null,null,null,null,null,null,null,null,null,null,null,null,"","","","",null,null,null,null,null,null,null,null,null,null,null,null,null,null,null,null,null,null,null,null,null,null,0,0,0,0]
["Tibolona 2,5mg comp.",null,0,null,null,null,null,null,null,null,"",null,null,null,null,null,null,null,null,null,null,null,null,null,null,null,null,null,null,null,null,null,null,null,null,null,null,null,null,null,null,null,null,null,null,null,null,null,null,null,null,null,null,null,null,null,null,null,null,null,null,null,null,null,null,null,null,null,null,null,null,null,null,null,null,null,null,null,"","","","",null,null,null,null,null,null,null,null,null,null,null,null,null,null,null,null,null,null,null,null,null,null,0,0,0,0]
["Terapia Dual",null,0]
["Total",null,{"$f":"SUM(D94:H94)","v":0},{"$f":"SUM(D87:D93)","v":0},{"$f":"SUM(E87:E93)","v":0},0,{"$f":"SUM(G87:G93)","v":0},0,0,0]
["SECCION G: GESTANTES EN CONTROL CON ECOGRAFÍA POR TRIMESTRE DE GESTACION (EN EL SEMESTRE)"]
["Población","Primer trimestre","Segundo trimestre","Tercer trimestre","Total de Gestantes con Ecografías del extrasistema"]
["Menor de 15",null,null,null,null,{"$f":"CA97","v":""},null,null,null,null,null,null,null,null,null,null,null,null,null,null,null,null,null,null,null,null,null,null,null,null,null,null,null,null,null,null,null,null,null,null,null,null,null,null,null,null,null,null,null,null,null,null,null,null,null,null,null,null,null,null,null,null,null,null,null,null,null,null,null,null,null,null,null,null,null,null,null,null,{"$f":"IF($E97>$B97+$C97+$D97, \"* El total de ecografías realizadas en el extrasistema en menores de 15 años, no puede ser mayor al nº de ecografias realizadas en los tres trimestres. \", \"\")","v":""},null,null,null,null,null,null,null,null,null,null,null,null,null,null,null,null,null,null,null,null,null,null,null,null,null,{"$f":"IF($E97>$B97+$C97+$D97, 1,0)","v":0}]
["15 - 19 ",null,null,null,null,{"$f":"CA98","v":""},null,null,null,null,null,null,null,null,null,null,null,null,null,null,null,null,null,null,null,null,null,null,null,null,null,null,null,null,null,null,null,null,null,null,null,null,null,null,null,null,null,null,null,null,null,null,null,null,null,null,null,null,null,null,null,null,null,null,null,null,null,null,null,null,null,null,null,null,null,null,null,null,{"$f":"IF($E98>$B98+$C98+$D98, \"* El total de ecografías realizadas en el extrasistema en menores de 15-19 años, no puede ser mayor al nº de ecografias realizadas en los tres trimestres. \", \"\")","v":""},null,null,null,null,null,null,null,null,null,null,null,null,null,null,null,null,null,null,null,null,null,null,null,null,null,{"$f":"IF($E98>$B98+$C98+$D98, 1,0)","v":0}]
["20 - 24",null,null,null,null,"",null,null,null,null,null,null,null,null,null,null,null,null,null,null,null,null,null,null,null,null,null,null,null,null,null,null,null,null,null,null,null,null,null,null,null,null,null,null,null,null,null,null,null,null,null,null,null,null,null,null,null,null,null,null,null,null,null,null,null,null,null,null,null,null,null,null,null,null,null,null,null,null,{"$f":"IF($E99>$B99+$C99+$D99, \"* El total de ecografías realizadas en el extrasistema en menores de 20-24 años, no puede ser mayor al nº de ecografias realizadas en los tres trimestres. \", \"\")","v":""},null,null,null,null,null,null,null,null,null,null,null,null,null,null,null,null,null,null,null,null,null,null,null,null,null,0]
["25 - 29",null,null,null,null,"",null,null,null,null,null,null,null,null,null,null,null,null,null,null,null,null,null,null,null,null,null,null,null,null,null,null,null,null,null,null,null,null,null,null,null,null,null,null,null,null,null,null,null,null,null,null,null,null,null,null,null,null,null,null,null,null,null,null,null,null,null,null,null,null,null,null,null,null,null,null,null,null,{"$f":"IF($E100>$B100+$C100+$D100, \"* El total de ecografías realizadas en el extrasistema en menores de 28-29 años, no puede ser mayor al nº de ecografias realizadas en los tres trimestres. \", \"\")","v":""},null,null,null,null,null,null,null,null,null,null,null,null,null,null,null,null,null,null,null,null,null,null,null,null,null,0]
["30 - 34",null,null,null,null,"",null,null,null,null,null,null,null,null,null,null,null,null,null,null,null,null,null,null,null,null,null,null,null,null,null,null,null,null,null,null,null,null,null,null,null,null,null,null,null,null,null,null,null,null,null,null,null,null,null,null,null,null,null,null,null,null,null,null,null,null,null,null,null,null,null,null,null,null,null,null,null,null,{"$f":"IF($E101>$B101+$C101+$D101, \"* El total de ecografías realizadas en el extrasistema en menores de 30-34 años, no puede ser mayor al nº de ecografias realizadas en los tres trimestres. \", \"\")","v":""},null,null,null,null,null,null,null,null,null,null,null,null,null,null,null,null,null,null,null,null,null,null,null,null,null,0]
["35 - 39",null,null,null,null,"",null,null,null,null,null,null,null,null,null,null,null,null,null,null,null,null,null,null,null,null,null,null,null,null,null,null,null,null,null,null,null,null,null,null,null,null,null,null,null,null,null,null,null,null,null,null,null,null,null,null,null,null,null,null,null,null,null,null,null,null,null,null,null,null,null,null,null,null,null,null,null,null,{"$f":"IF($E102>$B102+$C102+$D102, \"* El total de ecografías realizadas en el extrasistema en menores de 35-39 años, no puede ser mayor al nº de ecografias realizadas en los tres trimestres. \", \"\")","v":""},null,null,null,null,null,null,null,null,null,null,null,null,null,null,null,null,null,null,null,null,null,null,null,null,null,0]
["40 - 44",null,null,null,null,"",null,null,null,null,null,null,null,null,null,null,null,null,null,null,null,null,null,null,null,null,null,null,null,null,null,null,null,null,null,null,null,null,null,null,null,null,null,null,null,null,null,null,null,null,null,null,null,null,null,null,null,null,null,null,null,null,null,null,null,null,null,null,null,null,null,null,null,null,null,null,null,null,{"$f":"IF($E103>$B103+$C103+$D103, \"* El total de ecografías realizadas en el extrasistema en menores de 40-44 años, no puede ser mayor al nº de ecografias realizadas en los tres trimestres. \", \"\")","v":""},null,null,null,null,null,null,null,null,null,null,null,null,null,null,null,null,null,null,null,null,null,null,null,null,null,0]
["45 - 49",null,null,null,null,"",null,null,null,null,null,null,null,null,null,null,null,null,null,null,null,null,null,null,null,null,null,null,null,null,null,null,null,null,null,null,null,null,null,null,null,null,null,null,null,null,null,null,null,null,null,null,null,null,null,null,null,null,null,null,null,null,null,null,null,null,null,null,null,null,null,null,null,null,null,null,null,null,{"$f":"IF($E104>$B104+$C104+$D104, \"* El total de ecografías realizadas en el extrasistema en menores de 45-49 años, no puede ser mayor al nº de ecografias realizadas en los tres trimestres. \", \"\")","v":""},null,null,null,null,null,null,null,null,null,null,null,null,null,null,null,null,null,null,null,null,null,null,null,null,null,0]
["50 - 54",null,null,null,null,"",null,null,null,null,null,null,null,null,null,null,null,null,null,null,null,null,null,null,null,null,null,null,null,null,null,null,null,null,null,null,null,null,null,null,null,null,null,null,null,null,null,null,null,null,null,null,null,null,null,null,null,null,null,null,null,null,null,null,null,null,null,null,null,null,null,null,null,null,null,null,null,null,{"$f":"IF($E105>$B105+$C105+$D105, \"* El total de ecografías realizadas en el extrasistema en menores de 50-54 años, no puede ser mayor al nº de ecografias realizadas en los tres trimestres. \", \"\")","v":""},null,null,null,null,null,null,null,null,null,null,null,null,null,null,null,null,null,null,null,null,null,null,null,null,null,0]
["TOTAL",{"$f":"SUM(B97:B105)","v":0},{"$f":"SUM(C97:C105)","v":0},{"$f":"SUM(D97:D105)","v":0},{"$f":"SUM(E97:E105)","v":0}]
["SECCION H: MUJERES BAJO CONTROL DE REGULACIÓN DE FERTILIDAD SEGÚN ESTADO NUTRICIONAL "]
["POBLACION","ESTADO\nNUTRICIONAL","TOTAL","GRUPOS DE EDAD (en años)"]
[null,null,null,"Menos 15 años","15 a 19 años","20 a 24 años","25 a 29 años","30 a 34 años","35 a 39 años","40 a 44 años","45 a 49 años","50 a 54 años"]
["MUJERES BAJO CONTROL DE REGULACIÓN DE FERTILIDAD SEGÚN ESTADO NUTRICIONAL ","OBESA",{"$f":"SUM(D110:L110)","v":0}]
[null,"SOBREPESO",{"$f":"SUM(D111:L111)","v":0}]
[null,"NORMAL",{"$f":"SUM(D112:L112)","v":0}]
[null,"BAJO PESO",{"$f":"SUM(D113:L113)","v":0}]
[null,"TOTAL",{"$f":"SUM(D114:L114)","v":0},{"$f":"SUM(D110:D113)","v":0},{"$f":"SUM(E110:E113)","v":0},0,0,0,0,0,0,0]
["NIVEL SECUNDARIO"]
["SECCIÓN I POBLACIÓN EN CONTROL POR PATOLOGÍAS DE ALTO RIESGO OBSTÉTRICO"]
["PATOLOGÍA","TOTAL"]
["Preeclampsia (PE) ",null,{"$f":"($CA109&$CB109&$CC109&$CD109&$CE109&$CF109&$CG109&$CH109&$CI109&$CJ109&$CL109&$CM109&$CN109&$CO109&$CP109&$CQ109&$CR109&$CS109&$CT109&$CU109&$CV109&$CW109&$CX109&$CY109&$CZ109)","v":""}]
["Sindrome Hipertensivo del Embarazo (SHE)",null,""]
["Factores de riesgo y condicionantes de Parto Prematuro",null,""]
["Retardo Crecimiento Intrauterino (RCIU )",null,""]
["SÍFILIS",null,""]
["VIH",null,""]
["Diabetes Pre Gestacional",null,""]
["Diabetes Gestacional",null,""]
["Cesárea anterior",null,""]
["Malformación Congénita",null,""]
["Anemia",null,""]
["Cardiopatías",null,""]
["Pielonefritis",null,""]
["Rh(-) sensibilizada",null,""]
["Placenta previa",null,""]
["Chagas",null,""]
["Colestasia Intrahépatica de Embarazo",null,""]
["Otras patologías del embarazo",null,""]
["TOTAL",{"$f":"SUM(B118:B135)","v":0}]
[]
[]
[]
[]
[]
[]
[]
[]
[]
[]
[]
[{"$f":"SUM(C11:S34,B38:F47,B51:C55,C59:L68,B71:B75,B78:B82,C87:J94,B97:E106,,B118:B136,D110:L114)","v":{"$error":"#REF!"}},"datos"]
[{"$f":"SUM(DA$10:DZ138)","v":{"$error":"#REF!"}},"errores"]

{"sheet":"P2","index":2,"n_rows":215,"n_cols":119,"rows_kept":215,"cut":false,"hidden":false,"merged":[[203,0,203,1],[204,0,206,0],[207,0,213,0],[214,0,214,1],[154,0,154,1],[166,0,166,1],[156,0,156,1],[167,0,167,1],[183,0,183,1],[171,0,171,1],[172,0,172,1],[173,0,173,1],[175,0,175,1],[176,0,176,1],[177,0,177,1],[178,0,178,1],[179,0,179,1],[181,0,181,1],[182,0,182,1],[155,0,155,1],[157,0,157,1],[162,0,162,1],[163,0,163,1],[164,0,164,1],[200,0,202,1],[200,2,201,4],[200,5,200,24],[200,25,201,26],[200,27,201,28],[200,29,201,30],[200,31,201,32],[200,33,201,34],[201,5,201,6],[201,7,201,8],[201,9,201,10],[201,11,201,12],[201,13,201,14],[201,15,201,16],[201,17,201,18],[201,19,201,20],[201,21,201,22],[201,23,201,24],[194,0,194,1],[195,0,195,1],[196,0,196,1],[197,0,197,1],[168,0,168,1],[191,0,193,1],[158,0,158,1],[159,0,159,1],[161,0,161,1],[187,0,187,1],[169,0,169,1],[170,0,170,1],[165,0,165,1],[174,0,174,1],[180,0,180,1],[186,0,186,1],[191,43,192,44],[191,45,192,46],[192,5,192,6],[192,7,192,8],[192,9,192,10],[192,11,192,12],[192,13,192,14],[192,15,192,16],[192,17,192,18],[192,19,192,20],[192,21,192,22],[192,23,192,24],[192,25,192,26],[192,27,192,28],[192,29,192,30],[192,31,192,32],[192,33,192,34],[192,35,192,36],[192,37,192,38],[192,39,192,40],[192,41,192,42],[101,9,102,9],[73,0,73,19],[101,12,102,12],[101,13,102,13],[82,0,87,0],[76,0,81,0],[101,11,102,11],[191,2,192,4],[191,5,191,42],[151,0,151,1],[160,0,160,1],[147,0,147,1],[149,0,149,1],[130,0,130,1],[123,0,123,1],[108,2,109,2],[115,0,115,1],[118,0,118,1],[120,0,120,1],[113,2,114,2],[117,0,117,1],[113,0,114,1],[111,0,111,1],[126,2,127,4],[121,0,121,1],[122,0,122,1],[41,13,41,14],[52,0,58,0],[59,0,62,0],[41,17,41,18],[40,0,42,1],[41,15,41,16],[41,7,41,8],[41,9,41,10],[41,11,41,12],[40,5,40,18],[43,0,43,1],[44,0,51,0],[40,2,41,4],[41,5,41,6],[63,0,72,0],[101,4,102,4],[101,3,102,3],[101,0,102,1],[101,2,102,2],[101,8,102,8],[101,10,102,10],[101,7,102,7],[139,0,139,1],[138,0,138,1],[137,0,137,1],[135,0,136,1],[132,0,132,1],[103,0,106,0],[75,0,75,1],[94,0,99,0],[101,6,102,6],[101,5,102,5],[88,0,93,0],[135,2,136,2],[135,3,135,8],[110,0,110,1],[108,0,109,1],[124,0,124,1],[133,0,133,1],[116,0,116,1],[126,0,128,1],[129,0,129,1],[131,0,131,1],[119,0,119,1],[127,5,127,6],[127,7,127,8],[39,0,39,12],[30,0,38,0],[17,0,22,0],[10,0,10,1],[11,0,16,0],[23,0,29,0],[5,0,5,23],[7,21,8,22],[7,23,8,24],[8,15,8,16],[8,17,8,18],[8,7,8,8],[8,9,8,10],[8,11,8,12],[7,0,9,1],[8,5,8,6],[8,13,8,14],[7,2,8,4],[8,19,8,20],[7,5,7,20],[127,9,127,10],[142,5,142,6],[142,7,142,8],[142,9,142,10],[142,11,142,12],[142,13,142,14],[142,15,142,16],[142,17,142,18],[126,5,126,10],[126,11,128,11],[141,43,142,44],[141,45,142,46],[142,33,142,34],[142,39,142,40],[142,41,142,42],[142,31,142,32],[142,19,142,20],[142,21,142,22],[142,23,142,24],[142,25,142,26],[142,27,142,28],[142,29,142,30],[145,0,145,1],[146,0,146,1],[185,0,185,1],[148,0,148,1],[152,0,152,1],[184,0,184,1],[188,0,188,1],[142,35,142,36],[142,37,142,38],[141,0,143,1],[141,2,142,4],[144,0,144,1],[141,5,141,42],[150,0,150,1],[153,0,153,1]]}
["DATOS DEL ESTABLECIMIENTO"]
[{"$f":"CONCATENATE(\"COMUNA: \",NOMBRE!$B$2,\" - \",\"( \",NOMBRE!$C$2,NOMBRE!$D$2,NOMBRE!$E$2,NOMBRE!$F$2,NOMBRE!$G$2,\" )\")","v":"COMUNA:  - (  )"}]
[{"$f":"CONCATENATE(\"ESTABLECIMIENTO/ESTRATEGIA: \",NOMBRE!$B$3,\" - \",\"( \",NOMBRE!$C$3,NOMBRE!$D$3,NOMBRE!$E$3,NOMBRE!$F$3,NOMBRE!$G$3,NOMBRE!$H$3,\" )\")","v":"ESTABLECIMIENTO/ESTRATEGIA:  - (  )"}]
[{"$f":"CONCATENATE(\"MES: \",NOMBRE!$B$6,\" - \",\"( \",NOMBRE!$C$6,NOMBRE!$D$6,\" )\")","v":"MES:  - (  )"}]
[{"$f":"CONCATENATE(\"AÑO: \",NOMBRE!$B$7)","v":"AÑO: 2023"}]
["REM-P2. POBLACIÓN EN CONTROL PROGRAMA NACIONAL  DE SALUD DE LA INFANCIA "]
["SECCION A: POBLACIÓN EN CONTROL, SEGÚN ESTADO NUTRICIONAL PARA NIÑOS MENOR DE UN MES-59 MESES"]
["INDICADOR NUTRICIONAL\nY\nPARÁMETROS DE MEDICIÓN",null,"TOTAL",null,null,"GRUPOS DE EDAD (en meses - años) Y SEXO",null,null,null,null,null,null,null,null,null,null,null,null,null,null,null,"Pueblos Originarios",null,"Población Migrantes"]
[null,null,null,null,null,"0 a 6 meses",null,"7 a 11 meses",null,"12 a 17 meses",null,"18 a 23 meses",null,"24 a 35 meses",null,"36 a 47 meses",null,"48 a 59 meses",null,"60 meses"]
[null,null,"Ambos sexos","Hombres","Mujeres","Hombres","Mujeres","Hombres","Mujeres","Hombres","Mujeres","Hombres","Mujeres","Hombres","Mujeres","Hombres","Mujeres","Hombres","Mujeres","Hombres","Mujeres","Hombres","Mujeres","Hombres","Mujeres"]
["TOTAL DE NIÑOS EN CONTROL",null,{"$f":"SUM(D11:E11)","v":0},{"$f":"+F11+H11+J11+L11+N11+P11+R11+T11","v":0},{"$f":"+G11+I11+K11+M11+O11+Q11+S11+U11","v":0},null,null,null,null,null,null,null,null,null,null,null,null,null,null,null,null,null,null,null,null,null,null,null,null,null,null,null,null,null,null,null,null,null,null,null,null,null,null,null,null,null,null,null,null,null,null,null,null,null,null,null,null,null,null,null,null,null,null,null,null,null,null,{"$f":"IF(#REF!+#REF!<>#REF!+#REF!,\"* El Total de niños (as) en Control de 1 mes debe ser igual al Total de niños(as) según Diagnóstico Nutricional Integrado. \",\"\")","v":{"$error":"#REF!"}},{"$f":"IF(#REF!+#REF!<>#REF!+#REF!,\"* El Total de niños (as) en Control de 2 meses debe ser igual al Total de niños(as) según Diagnóstico Nutricional Integrado. \",\"\")","v":{"$error":"#REF!"}},{"$f":"IF(#REF!+#REF!<>#REF!+#REF!,\"* El Total de niños (as) en Control de 3 meses debe ser igual al Total de niños(as) según Diagnóstico Nutricional Integrado. \",\"\")","v":{"$error":"#REF!"}},{"$f":"IF(#REF!+#REF!<>#REF!+#REF!,\"* El Total de niños (as) en Control de 4 meses debe ser igual al Total de niños(as) según Diagnóstico Nutricional Integrado. \",\"\")","v":{"$error":"#REF!"}},{"$f":"IF(#REF!+#REF!<>#REF!+#REF!,\"* El Total de niños (as) en Control de 5 meses debe ser igual al Total de niños(as) según Diagnóstico Nutricional Integrado. \",\"\")","v":{"$error":"#REF!"}},{"$f":"IF($F$11+$G$11<>$F$39+$G$39,\"* El Total de niños (as) en Control de 6 meses debe ser igual al Total de niños(as) según Diagnóstico Nutricional Integrado. \",\"\")","v":""},{"$f":"IF($H$11+$I$11<>$H$39+$I$39,\"* El Total de niños (as) en Control de 7 a 11 meses debe ser igual al Total de niños(as) según Diagnóstico Nutricional Integrado. \",\"\")","v":""},{"$f":"IF($J$11+$K$11<>$J$39+$K$39,\"* El Total de niños (as) en Control de 12 a 17 meses debe ser igual al Total de niños(as) según Diagnóstico Nutricional Integrado. \",\"\")","v":""},null,null,null,null,null,null,null,null,null,null,null,null,null,null,null,null,null,{"$f":"IF(#REF!+#REF!<>#REF!+#REF!,1,0)","v":{"$error":"#REF!"}},{"$f":"IF(#REF!+#REF!<>#REF!+#REF!,1,0)","v":{"$error":"#REF!"}},{"$f":"IF(#REF!+#REF!<>#REF!+#REF!,1,0)","v":{"$error":"#REF!"}},{"$f":"IF(#REF!+#REF!<>#REF!+#REF!,1,0)","v":{"$error":"#REF!"}},{"$f":"IF(#REF!+#REF!<>#REF!+#REF!,1,0)","v":{"$error":"#REF!"}},{"$f":"IF($F$11+$G$11<>$F$39+$G$39,1,0)","v":0},{"$f":"IF($H$11+$I$11<>$H$39+$I$39,1,0)","v":0},{"$f":"IF($J$11+$K$11<>$J$39+$K$39,1,0)","v":0}]
["INDICADOR PESO/EDAD","+ 2 D.S. (>= +2.0)",0,{"$f":"+F12+H12+J12+L12+N12+P12+R12+T12","v":0},{"$f":"+G12+I12+K12+M12+O12+Q12+S12+U12","v":0},null,null,null,null,null,null,null,null,null,null,null,null,null,null,null,null,null,null,null,null,{"$f":"BS14 & BT14","v":""},null,null,null,null,null,null,null,null,null,null,null,null,null,null,null,null,null,null,null,null,null,null,null,null,null,null,null,null,null,null,null,null,null,null,null,null,null,null,null,null,null,{"$f":"IF($L$11+$M$11<>$L$39+$M$39,\"* El Total de niños (as) en Control de 18 a 23 meses debe ser igual al Total de niños(as) según Diagnóstico Nutricional Integrado. \",\"\")","v":""},{"$f":"IF($N$11+$O$11<>$N$39+$O$39,\"* El Total de niños (as) en Control de 24 a 35 meses debe ser igual al Total de niños(as) según Diagnóstico Nutricional Integrado. \",\"\")","v":""},{"$f":"IF(#REF!+#REF!<>#REF!+#REF!,\"* El Total de niños (as) en Control de 36 a 41 meses debe ser igual al Total de niños(as) según Diagnóstico Nutricional Integrado. \",\"\")","v":{"$error":"#REF!"}},{"$f":"IF($P$11+$Q$11<>$P$39+$Q$39,\"* El Total de niños (as) en Control de 42 a 47 meses debe ser igual al Total de niños(as) según Diagnóstico Nutricional Integrado. \",\"\")","v":""},{"$f":"IF($R$11+$S$11<>$R$39+$S$39,\"* El Total de niños (as) en Control de 48 a 59 meses debe ser igual al Total de niños(as) según Diagnóstico Nutricional Integrado. \",\"\")","v":""},{"$f":"IF($C11>=$V11+$W11,\"\",\"* El Total de Pueblos Originarios no debe ser mayor al total de niños en control. \")","v":""},{"$f":"IF($C11>=$X11+$Y11,\"\",\"* El Total de Población Migrantes no debe ser mayor al total de niños en control. \")","v":""},{"$f":"IF($V$11+$W$11<>$T$39+$U$39,\"* El Total de niños (as) en Control de Pueblos Originarios debe ser igual al Total de niños(as) según Diagnóstico Nutricional Integrado. \",\"\")","v":""},{"$f":"IF($X$11+$Y$11<>$V$39+$W$39,\"* El Total de niños (as) en Control de Población Migrantes debe ser igual al Total de niños(as) según Diagnóstico Nutricional Integrado. \",\"\")","v":""},null,null,null,null,null,null,null,null,null,null,null,null,null,null,null,null,{"$f":"IF($L$11+$M$11<>$L$39+$M$39,1,0)","v":0},{"$f":"IF($N$11+$O$11<>$N$39+$O$39,1,0)","v":0},{"$f":"IF(#REF!+#REF!<>#REF!+#REF!,1,0)","v":{"$error":"#REF!"}},{"$f":"IF($P$11+$Q$11<>$P$39+$Q$39,1,0)","v":0},{"$f":"IF($R$11+$S$11<>$R$39+$S$39,1,0)","v":0},{"$f":"IF($C11>=$V11+$W11,0,1)","v":0},{"$f":"IF($C11>=$X11+$Y11,0,1)","v":0},{"$f":"IF($V$11+$W$11<>$T$39+$U$39,1,0)","v":0},{"$f":"IF($X$11+$Y$11<>$V$39+$W$39,1,0)","v":0}]
[null,"+ 1 D.S. (+1.0 a +1.9)",0,0,0,null,null,null,null,null,null,null,null,null,null,null,null,null,null,null,null,null,null,null,null,{"$f":"BU14 & BV14","v":""},null,null,null,null,null,null,null,null,null,null,null,null,null,null,null,null,null,null,null,null,null,null,null,null,null,null,null,null,null,null,null,null,null,null,null,null,null,null,null,null,null,null,null,null,null,null,null,null,{"$f":"IF(AND(D11<>0,V11=\"\"), \"* No olvide escribir en la celda de Pueblos Originarios (Digite CERO si no tiene). \",IF(AND(E11<>0,W11=\"\"), \"* No olvide escribir en la celda de Pueblos Originarios (Digite CERO si no tiene). \",\"\"))","v":""},{"$f":"IF(AND(D11<>0,X11=\"\"), \"* No olvide escribir en la celda de Población Migrantes (Digite CERO si no tiene). \",IF(AND(E11<>0,Y11=\"\"), \"* No olvide escribir en la celda de Población Migrantes (Digite CERO si no tiene). \",\"\"))","v":""},null,null,null,null,null,null,null,null,null,null,null,null,null,null,null,null,null,null,null,null,null,null,null,{"$f":"IF(AND(D11<>0,V11=\"\"), 1,IF(AND(E11<>0,W11=\"\"), 1,0))","v":0},{"$f":"IF(AND(D11<>0,X11=\"\"), 1,IF(AND(E11<>0,Y11=\"\"), 1,0))","v":0}]
[null,"TOTAL",0,{"$f":"+F14+H14+J14+L14+N14+P14+R14+T14","v":0},{"$f":"+G14+I14+K14+M14+O14+Q14+S14+U14","v":0},{"$f":"+SUM(F12:F13)","v":0},{"$f":"+SUM(G12:G13)","v":0},0,{"$f":"+SUM(I12:I13)","v":0},{"$f":"SUM(J12:J13)","v":0},{"$f":"SUM(K12:K13)","v":0},{"$f":"SUM(L12:L13)","v":0},0,0,0,0,0,0,0,{"$f":"+SUM(T12:T13)","v":0},0,0,0,0,0,{"$f":"\"\" & BP14 & BQ14","v":""},null,null,null,null,null,null,null,null,null,null,null,null,null,null,null,null,null,null,null,null,null,null,null,null,null,null,null,null,null,null,null,null,null,null,null,null,null,null,null,null,null,{"$f":"IF($C14>=$V14+$W14,\"\",\"* El Total de Pueblos Originarios no debe ser mayor al Total Indicador peso/edad\")","v":""},{"$f":"IF($C14>=$X14+$Y14,\"\",\"* El Total de Población Migrante no debe ser mayor al Total Indicador peso/edad\")","v":""},null,{"$f":"IF(AND(D12<>0,V12=\"\"), \"* No olvide escribir en la celda de Pueblos Originarios (Digite CERO si no tiene). \",IF(AND(E12<>0,W12=\"\"), \"* No olvide escribir en la celda de Pueblos Originarios (Digite CERO si no tiene). \",\"\"))","v":""},{"$f":"IF(AND(D12<>0,X12=\"\"), \"* No olvide escribir en la celda de Población Migrantes (Digite CERO si no tiene). \",IF(AND(E12<>0,Y12=\"\"), \"* No olvide escribir en la celda de Población Migrantes (Digite CERO si no tiene). \",\"\"))","v":""},{"$f":"IF(AND(D13<>0,V13=\"\"), \"* No olvide escribir en la celda de Pueblos Originarios (Digite CERO si no tiene). \",IF(AND(E13<>0,W13=\"\"), \"* No olvide escribir en la celda de Pueblos Originarios (Digite CERO si no tiene). \",\"\"))","v":""},{"$f":"IF(AND(D13<>0,X13=\"\"), \"* No olvide escribir en la celda de Población Migrantes (Digite CERO si no tiene). \",IF(AND(E13<>0,Y13=\"\"), \"* No olvide escribir en la celda de Población Migrantes (Digite CERO si no tiene). \",\"\"))","v":""},null,null,null,null,null,null,null,null,null,null,null,null,null,null,null,null,null,null,{"$f":"IF($C14>=$V14+$W14,0,1)","v":0},{"$f":"IF($C14>=$X14+$Y14,0,1)","v":0},null,null,{"$f":"IF(AND(D12<>0,V12=\"\"), 1,IF(AND(E12<>0,W12=\"\"), 1,0))","v":0},{"$f":"IF(AND(D12<>0,X12=\"\"), 1,IF(AND(E12<>0,Y12=\"\"), 1,0))","v":0},{"$f":"IF(AND(D13<>0,X13=\"\"), 1,IF(AND(E13<>0,Y13=\"\"), 1,0))","v":0},{"$f":"IF(AND(D13<>0,X13=\"\"), 1,IF(AND(E13<>0,Y13=\"\"), 1,0))","v":0}]
[null,"- 1 D.S. (-1.0 a -1.9)",0,{"$f":"+F15+H15+J15+L15+N15+P15+R15+T15","v":0},{"$f":"+G15+I15+K15+M15+O15+Q15+S15+U15","v":0},null,null,null,null,null,null,null,null,null,null,null,null,null,null,null,null,null,null,null,null,{"$f":"BW15 & BX15","v":""},null,null,null,null,null,null,null,null,null,null,null,null,null,null,null,null,null,null,null,null,null,null,null,null,null,null,null,null,null,null,null,null,null,null,null,null,null,null,null,null,null,{"$f":"IF($C17>=$V17+$W17,\"\",\"* El Total de Pueblos Originarios no debe ser mayor al Total Indicador peso/edad\")","v":""},{"$f":"IF($C17>=$X17+$Y17,\"\",\"* El Total de Población Migrante no debe ser mayor al Total Indicador peso/edad\")","v":""},null,null,null,null,null,{"$f":"IF(AND(D15<>0,V15=\"\"), \"* No olvide escribir en la celda de Pueblos Originarios (Digite CERO si no tiene). \",IF(AND(E15<>0,W15=\"\"), \"* No olvide escribir en la celda de Pueblos Originarios (Digite CERO si no tiene). \",\"\"))","v":""},{"$f":"IF(AND(D15<>0,X15=\"\"), \"* No olvide escribir en la celda de Población Migrantes (Digite CERO si no tiene). \",IF(AND(E15<>0,Y15=\"\"), \"* No olvide escribir en la celda de Población Migrantes (Digite CERO si no tiene). \",\"\"))","v":""},null,null,null,null,null,null,null,null,null,null,null,null,null,null,null,null,{"$f":"IF($C17>=$V17+$W17,0,1)","v":0},{"$f":"IF($C17>=$X17+$Y17,0,1)","v":0},null,null,null,null,null,{"$f":"IF(AND(D15<>0,V15=\"\"), 1,IF(AND(E15<>0,W15=\"\"), 1,0))","v":0},{"$f":"IF(AND(D15<>0,X15=\"\"), 1,IF(AND(E15<>0,Y15=\"\"), 1,0))","v":0}]
[null,"- 2 D.S. (<= -2.0)",0,0,0,null,null,null,null,null,null,null,null,null,null,null,null,null,null,null,null,null,null,null,null,{"$f":"BW16 & BX16","v":""},null,null,null,null,null,null,null,null,null,null,null,null,null,null,null,null,null,null,null,null,null,null,null,null,null,null,null,null,null,null,null,null,null,null,null,null,null,null,null,null,null,null,null,null,null,null,null,null,{"$f":"IF(AND(D16<>0,V16=\"\"), \"* No olvide escribir en la celda de Pueblos Originarios (Digite CERO si no tiene). \",IF(AND(E16<>0,W16=\"\"), \"* No olvide escribir en la celda de Pueblos Originarios (Digite CERO si no tiene). \",\"\"))","v":""},{"$f":"IF(AND(D16<>0,X16=\"\"), \"* No olvide escribir en la celda de Población Migrantes (Digite CERO si no tiene). \",IF(AND(E16<>0,Y16=\"\"), \"* No olvide escribir en la celda de Población Migrantes (Digite CERO si no tiene). \",\"\"))","v":""},null,null,null,null,null,null,null,null,null,null,null,null,null,null,null,null,null,null,null,null,null,null,null,{"$f":"IF(AND(D16<>0,V16=\"\"), 1,IF(AND(E16<>0,W16=\"\"), 1,0))","v":0},{"$f":"IF(AND(D16<>0,X16=\"\"), 1,IF(AND(E16<>0,Y16=\"\"), 1,0))","v":0}]
[null,"TOTAL",0,{"$f":"+F17+H17+J17+L17+N17+P17+R17+T17","v":0},{"$f":"+G17+I17+K17+M17+O17+Q17+S17+U17","v":0},{"$f":"SUM(F15:F16)","v":0},0,0,0,{"$f":"SUM(J15:J16)","v":0},{"$f":"SUM(K15:K16)","v":0},0,0,0,0,0,0,{"$f":"SUM(R15:R16)","v":0},0,{"$f":"SUM(T15:T16)","v":0},0,0,0,0,0,{"$f":"\"\" & BP15 & BQ15","v":""}]
["INDICADOR PESO/TALLA","+ 2 D.S. (>= +2.0)",0,{"$f":"+F18+H18+J18+L18+N18+P18+R18+T18","v":0},{"$f":"+G18+I18+K18+M18+O18+Q18+S18+U18","v":0},null,null,null,null,null,null,null,null,null,null,null,null,null,null,null,null,null,null,null,null,{"$f":"BW18 & BX18","v":""},null,null,null,null,null,null,null,null,null,null,null,null,null,null,null,null,null,null,null,null,null,null,null,null,null,null,null,null,null,null,null,null,null,null,null,null,null,null,null,null,null,null,null,null,null,null,null,null,{"$f":"IF(AND(D18<>0,V18=\"\"), \"* No olvide escribir en la celda de Pueblos Originarios (Digite CERO si no tiene). \",IF(AND(E18<>0,W18=\"\"), \"* No olvide escribir en la celda de Pueblos Originarios (Digite CERO si no tiene). \",\"\"))","v":""},{"$f":"IF(AND(D18<>0,X18=\"\"), \"* No olvide escribir en la celda de Población Migrantes (Digite CERO si no tiene). \",IF(AND(E18<>0,Y18=\"\"), \"* No olvide escribir en la celda de Población Migrantes (Digite CERO si no tiene). \",\"\"))","v":""},null,null,null,null,null,null,null,null,null,null,null,null,null,null,null,null,null,null,null,null,null,null,null,{"$f":"IF(AND(D18<>0,V18=\"\"), 1,IF(AND(E18<>0,W18=\"\"), 1,0))","v":0},{"$f":"IF(AND(D18<>0,X18=\"\"), 1,IF(AND(E18<>0,Y18=\"\"), 1,0))","v":0}]
[null,"+ 1 D.S. (+1.0 a +1.9)",0,0,0,null,null,null,null,null,null,null,null,null,null,null,null,null,null,null,null,null,null,null,null,{"$f":"BW19 & BX19","v":""},null,null,null,null,null,null,null,null,null,null,null,null,null,null,null,null,null,null,null,null,null,null,null,null,null,null,null,null,null,null,null,null,null,null,null,null,null,null,null,null,null,null,null,null,null,null,null,null,{"$f":"IF(AND(D19<>0,V19=\"\"), \"* No olvide escribir en la celda de Pueblos Originarios (Digite CERO si no tiene). \",IF(AND(E19<>0,W19=\"\"), \"* No olvide escribir en la celda de Pueblos Originarios (Digite CERO si no tiene). \",\"\"))","v":""},{"$f":"IF(AND(D19<>0,X19=\"\"), \"* No olvide escribir en la celda de Población Migrantes (Digite CERO si no tiene). \",IF(AND(E19<>0,Y19=\"\"), \"* No olvide escribir en la celda de Población Migrantes (Digite CERO si no tiene). \",\"\"))","v":""},null,null,null,null,null,null,null,null,null,null,null,null,null,null,null,null,null,null,null,null,null,null,null,{"$f":"IF(AND(D19<>0,V19=\"\"), 1,IF(AND(E19<>0,W19=\"\"), 1,0))","v":0},{"$f":"IF(AND(D19<>0,X19=\"\"), 1,IF(AND(E19<>0,Y19=\"\"), 1,0))","v":0}]
[null,"TOTAL",0,{"$f":"+F20+H20+J20+L20+N20+P20+R20+T20","v":0},{"$f":"+G20+I20+K20+M20+O20+Q20+S20+U20","v":0},{"$f":"+SUM(F18:F19)","v":0},0,0,0,0,0,0,0,0,0,0,0,0,0,{"$f":"+SUM(T18:T19)","v":0},0,0,0,0,0,{"$f":"\"\" & BP20 & BQ20","v":""},null,null,null,null,null,null,null,null,null,null,null,null,null,null,null,null,null,null,null,null,null,null,null,null,null,null,null,null,null,null,null,null,null,null,null,null,null,null,null,null,null,{"$f":"IF($C20>=$V20+$W20,\"\",\"* El Total de Pueblos Originarios no debe ser mayor al Total Indicador peso/talla\")","v":""},{"$f":"IF($C20>=$X20+$Y20,\"\",\"* El Total de Población Migrante no debe ser mayor al Total Indicador peso/talla\")","v":""},null,null,null,null,null,null,null,null,null,null,null,null,null,null,null,null,null,null,null,null,null,null,null,{"$f":"IF($C20>=$V20+$W20,0,1)","v":0},{"$f":"IF($C20>=$X20+$Y20,0,1)","v":0}]
[null,"- 1 D.S. (-1.0 a -1.9)",0,{"$f":"+F21+H21+J21+L21+N21+P21+R21+T21","v":0},{"$f":"+G21+I21+K21+M21+O21+Q21+S21+U21","v":0},null,null,null,null,null,null,null,null,null,null,null,null,null,null,null,null,null,null,null,null,{"$f":"BW21 & BX21","v":""},null,null,null,null,null,null,null,null,null,null,null,null,null,null,null,null,null,null,null,null,null,null,null,null,null,null,null,null,null,null,null,null,null,null,null,null,null,null,null,null,null,null,null,null,null,null,null,null,{"$f":"IF(AND(D21<>0,V21=\"\"), \"* No olvide escribir en la celda de Pueblos Originarios (Digite CERO si no tiene). \",IF(AND(E21<>0,W21=\"\"), \"* No olvide escribir en la celda de Pueblos Originarios (Digite CERO si no tiene). \",\"\"))","v":""},{"$f":"IF(AND(D21<>0,X21=\"\"), \"* No olvide escribir en la celda de Población Migrantes (Digite CERO si no tiene). \",IF(AND(E21<>0,Y21=\"\"), \"* No olvide escribir en la celda de Población Migrantes (Digite CERO si no tiene). \",\"\"))","v":""},null,null,null,null,null,null,null,null,null,null,null,null,null,null,null,null,null,null,null,null,null,null,null,{"$f":"IF(AND(D21<>0,V21=\"\"), 1,IF(AND(E21<>0,W21=\"\"), 1,0))","v":0},{"$f":"IF(AND(D21<>0,X21=\"\"), 1,IF(AND(E21<>0,Y21=\"\"), 1,0))","v":0}]
[null,"- 2 D.S. (<= -2.0)",0,0,0,null,null,null,null,null,null,null,null,null,null,null,null,null,null,null,null,null,null,null,null,{"$f":"BW22 & BX22","v":""},null,null,null,null,null,null,null,null,null,null,null,null,null,null,null,null,null,null,null,null,null,null,null,null,null,null,null,null,null,null,null,null,null,null,null,null,null,null,null,null,null,null,null,null,null,null,null,null,{"$f":"IF(AND(D22<>0,V22=\"\"), \"* No olvide escribir en la celda de Pueblos Originarios (Digite CERO si no tiene). \",IF(AND(E22<>0,W22=\"\"), \"* No olvide escribir en la celda de Pueblos Originarios (Digite CERO si no tiene). \",\"\"))","v":""},{"$f":"IF(AND(D22<>0,X22=\"\"), \"* No olvide escribir en la celda de Población Migrantes (Digite CERO si no tiene). \",IF(AND(E22<>0,Y22=\"\"), \"* No olvide escribir en la celda de Población Migrantes (Digite CERO si no tiene). \",\"\"))","v":""},null,null,null,null,null,null,null,null,null,null,null,null,null,null,null,null,null,null,null,null,null,null,null,{"$f":"IF(AND(D22<>0,V22=\"\"), 1,IF(AND(E22<>0,W22=\"\"), 1,0))","v":0},{"$f":"IF(AND(D22<>0,X22=\"\"), 1,IF(AND(E22<>0,Y22=\"\"), 1,0))","v":0}]
[null,"TOTAL",0,{"$f":"+F23+H23+J23+L23+N23+P23+R23+T23","v":0},{"$f":"+G23+I23+K23+M23+O23+Q23+S23+U23","v":0},{"$f":"SUM(F21:F22)","v":0},0,0,0,0,0,0,0,0,0,0,0,0,0,{"$f":"SUM(T21:T22)","v":0},0,0,0,0,0,{"$f":"\"\" & BP23 & BQ23","v":""},null,null,null,null,null,null,null,null,null,null,null,null,null,null,null,null,null,null,null,null,null,null,null,null,null,null,null,null,null,null,null,null,null,null,null,null,null,null,null,null,null,{"$f":"IF($C23>=$V23+$W23,\"\",\"* El Total de Pueblos Originarios no debe ser mayor al Total Indicador peso/talla. \")","v":""},{"$f":"IF($C23>=$X23+$Y23,\"\",\"* El Total de Población Migrantes no debe ser mayor al Total Indicador peso/talla. \")","v":""},null,null,null,null,null,null,null,null,null,null,null,null,null,null,null,null,null,null,null,null,null,null,null,{"$f":"IF($C23>=$V23+$W23,0,1)","v":0},{"$f":"IF($C23>=$X23+$Y23,0,1)","v":0}]
["INDICADOR TALLA/EDAD","+ 2 D.S. (>= +2.0)",0,{"$f":"+F24+H24+J24+L24+N24+P24+R24+T24","v":0},{"$f":"+G24+I24+K24+M24+O24+Q24+S24+U24","v":0},null,null,null,null,null,null,null,null,null,null,null,null,null,null,null,null,null,null,null,null,{"$f":"BW24 & BX24","v":""},null,null,null,null,null,null,null,null,null,null,null,null,null,null,null,null,null,null,null,null,null,null,null,null,null,null,null,null,null,null,null,null,null,null,null,null,null,null,null,null,null,null,null,null,null,null,null,null,{"$f":"IF(AND(D24<>0,T24=\"\"), \"* No olvide escribir en la celda de Pueblos Originarios (Digite CERO si no tiene). \",IF(AND(E24<>0,U24=\"\"), \"* No olvide escribir en la celda de Pueblos Originarios (Digite CERO si no tiene). \",\"\"))","v":""},{"$f":"IF(AND(D24<>0,V24=\"\"), \"* No olvide escribir en la celda de Población Migrantes (Digite CERO si no tiene). \",IF(AND(E24<>0,W24=\"\"), \"* No olvide escribir en la celda de Población Migrantes (Digite CERO si no tiene). \",\"\"))","v":""},null,null,null,null,null,null,null,null,null,null,null,null,null,null,null,null,null,null,null,null,null,null,null,{"$f":"IF(AND(D24<>0,T24=\"\"), 1,IF(AND(E24<>0,U24=\"\"), 1,0))","v":0},{"$f":"IF(AND(D24<>0,V24=\"\"), 1,IF(AND(E24<>0,W24=\"\"), 1,0))","v":0}]
[null,"+ 1 D.S. (+1.0 a +1.9)",0,0,0,null,null,null,null,null,null,null,null,null,null,null,null,null,null,null,null,null,null,null,null,{"$f":"BW25 & BX25","v":""},null,null,null,null,null,null,null,null,null,null,null,null,null,null,null,null,null,null,null,null,null,null,null,null,null,null,null,null,null,null,null,null,null,null,null,null,null,null,null,null,null,null,null,null,null,null,null,null,{"$f":"IF(AND(D25<>0,T25=\"\"), \"* No olvide escribir en la celda de Pueblos Originarios (Digite CERO si no tiene). \",IF(AND(E25<>0,U25=\"\"), \"* No olvide escribir en la celda de Pueblos Originarios (Digite CERO si no tiene). \",\"\"))","v":""},{"$f":"IF(AND(D25<>0,V25=\"\"), \"* No olvide escribir en la celda de Población Migrantes (Digite CERO si no tiene). \",IF(AND(E25<>0,W25=\"\"), \"* No olvide escribir en la celda de Población Migrantes (Digite CERO si no tiene). \",\"\"))","v":""},null,null,null,null,null,null,null,null,null,null,null,null,null,null,null,null,null,null,null,null,null,null,null,{"$f":"IF(AND(D25<>0,T25=\"\"), 1,IF(AND(E25<>0,U25=\"\"), 1,0))","v":0},{"$f":"IF(AND(D25<>0,V25=\"\"), 1,IF(AND(E25<>0,W25=\"\"), 1,0))","v":0}]
[null,"TOTAL",0,{"$f":"+F26+H26+J26+L26+N26+P26+R26+T26","v":0},{"$f":"+G26+I26+K26+M26+O26+Q26+S26+U26","v":0},{"$f":"SUM(F24:F25)","v":0},0,0,0,0,0,0,0,0,0,0,0,0,0,0,0,0,0,{"$f":"SUM(X24:X25)","v":0},0,{"$f":"\"\" & BP26 & BQ26","v":""},null,null,null,null,null,null,null,null,null,null,null,null,null,null,null,null,null,null,null,null,null,null,null,null,null,null,null,null,null,null,null,null,null,null,null,null,null,null,null,null,null,{"$f":"IF($C26>=$T26+$U26,\"\",\"* El Total de Pueblos Originarios no debe ser mayor al Total Indicador peso/talla. \")","v":""},{"$f":"IF($C26>=$V26+$W26,\"\",\"* El Total de Población Migrantes no debe ser mayor al Total Indicador peso/talla. \")","v":""},null,null,null,null,null,null,null,null,null,null,null,null,null,null,null,null,null,null,null,null,null,null,null,{"$f":"IF($C26>=$T26+$U26,0,1)","v":0},{"$f":"IF($C26>=$V26+$W26,0,1)","v":0}]
[null,"- 1 D.S. (-1.0 a -1.9)",0,{"$f":"+F27+H27+J27+L27+N27+P27+R27+T27","v":0},{"$f":"+G27+I27+K27+M27+O27+Q27+S27+U27","v":0},null,null,null,null,null,null,null,null,null,null,null,null,null,null,null,null,null,null,null,null,{"$f":"BW27 & BX27","v":""},null,null,null,null,null,null,null,null,null,null,null,null,null,null,null,null,null,null,null,null,null,null,null,null,null,null,null,null,null,null,null,null,null,null,null,null,null,null,null,null,null,null,null,null,null,null,null,null,{"$f":"IF(AND(D27<>0,T27=\"\"), \"* No olvide escribir en la celda de Pueblos Originarios (Digite CERO si no tiene). \",IF(AND(E27<>0,U27=\"\"), \"* No olvide escribir en la celda de Pueblos Originarios (Digite CERO si no tiene). \",\"\"))","v":""},{"$f":"IF(AND(D27<>0,V27=\"\"), \"* No olvide escribir en la celda de Población Migrantes (Digite CERO si no tiene). \",IF(AND(E27<>0,W27=\"\"), \"* No olvide escribir en la celda de Población Migrantes (Digite CERO si no tiene). \",\"\"))","v":""},null,null,null,null,null,null,null,null,null,null,null,null,null,null,null,null,null,null,null,null,null,null,null,{"$f":"IF(AND(D27<>0,T27=\"\"), 1,IF(AND(E27<>0,U27=\"\"), 1,0))","v":0},{"$f":"IF(AND(D27<>0,V27=\"\"), 1,IF(AND(E27<>0,W27=\"\"), 1,0))","v":0}]
[null,"- 2 D.S. (<= -2.0)",0,0,0,null,null,null,null,null,null,null,null,null,null,null,null,null,null,null,null,null,null,null,null,{"$f":"BW28 & BX28","v":""},null,null,null,null,null,null,null,null,null,null,null,null,null,null,null,null,null,null,null,null,null,null,null,null,null,null,null,null,null,null,null,null,null,null,null,null,null,null,null,null,null,null,null,null,null,null,null,null,{"$f":"IF(AND(D28<>0,T28=\"\"), \"* No olvide escribir en la celda de Pueblos Originarios (Digite CERO si no tiene). \",IF(AND(E28<>0,U28=\"\"), \"* No olvide escribir en la celda de Pueblos Originarios (Digite CERO si no tiene). \",\"\"))","v":""},{"$f":"IF(AND(D28<>0,V28=\"\"), \"* No olvide escribir en la celda de Población Migrantes (Digite CERO si no tiene). \",IF(AND(E28<>0,W28=\"\"), \"* No olvide escribir en la celda de Población Migrantes (Digite CERO si no tiene). \",\"\"))","v":""},null,null,null,null,null,null,null,null,null,null,null,null,null,null,null,null,null,null,null,null,null,null,null,{"$f":"IF(AND(D28<>0,T28=\"\"), 1,IF(AND(E28<>0,U28=\"\"), 1,0))","v":0},{"$f":"IF(AND(D28<>0,V28=\"\"), 1,IF(AND(E28<>0,W28=\"\"), 1,0))","v":0}]
[null,"TOTAL",0,{"$f":"+F29+H29+J29+L29+N29+P29+R29+T29","v":0},{"$f":"+G29+I29+K29+M29+O29+Q29+S29+U29","v":0},{"$f":"SUM(F27:F28)","v":0},0,0,0,0,0,0,0,0,0,0,0,0,0,0,0,0,0,{"$f":"SUM(X27:X28)","v":0},0,{"$f":"\"\" & BP29 & BQ29","v":""},null,null,null,null,null,null,null,null,null,null,null,null,null,null,null,null,null,null,null,null,null,null,null,null,null,null,null,null,null,null,null,null,null,null,null,null,null,null,null,null,null,{"$f":"IF($C29>=$T29+$U29,\"\",\"* El Total de Pueblos Originarios no debe ser mayor al Total Indicador peso/talla. \")","v":""},{"$f":"IF($C29>=$V29+$W29,\"\",\"* El Total de Población Migrantes no debe ser mayor al Total Indicador peso/talla. \")","v":""},null,null,null,null,null,null,null,null,null,null,null,null,null,null,null,null,null,null,null,null,null,null,null,{"$f":"IF($C29>=$T29+$U29,0,1)","v":0},{"$f":"IF($C29>=$V29+$W29,0,1)","v":0}]
[null,"PROMEDIO (-0,9 A + 0,9)",0,{"$f":"+F30+H30+J30+L30+N30+P30+R30+T30","v":0},{"$f":"+G30+I30+K30+M30+O30+Q30+S30+U30","v":0},null,null,null,null,null,null,null,null,null,null,null,null,null,null,null,null,null,null,null,null,{"$f":"BW30 & BX30","v":""},null,null,null,null,null,null,null,null,null,null,null,null,null,null,null,null,null,null,null,null,null,null,null,null,null,null,null,null,null,null,null,null,null,null,null,null,null,null,null,null,null,null,null,null,null,null,null,null,{"$f":"IF(AND(D30<>0,T30=\"\"), \"* No olvide escribir en la celda de Pueblos Originarios (Digite CERO si no tiene). \",IF(AND(E30<>0,U30=\"\"), \"* No olvide escribir en la celda de Pueblos Originarios (Digite CERO si no tiene). \",\"\"))","v":""},{"$f":"IF(AND(D30<>0,V30=\"\"), \"* No olvide escribir en la celda de Población Migrantes (Digite CERO si no tiene). \",IF(AND(E30<>0,W30=\"\"), \"* No olvide escribir en la celda de Población Migrantes (Digite CERO si no tiene). \",\"\"))","v":""},null,null,null,null,null,null,null,null,null,null,null,null,null,null,null,null,null,null,null,null,null,null,null,{"$f":"IF(AND(D30<>0,T30=\"\"), 1,IF(AND(E30<>0,U30=\"\"), 1,0))","v":0},{"$f":"IF(AND(D30<>0,V30=\"\"), 1,IF(AND(E30<>0,W30=\"\"), 1,0))","v":0}]
["DIAGNOSTICO NUTRICIONAL INTEGRADO","RIESGO DE DESNUTRIR/ DEFICIT PONDERAL*",0,0,0,null,null,null,null,null,null,null,null,null,null,null,null,null,null,null,null,null,null,null,null,"",null,null,null,null,null,null,null,null,null,null,null,null,null,null,null,null,null,null,null,null,null,null,null,null,null,null,null,null,null,null,null,null,null,null,null,null,null,null,null,null,null,null,null,null,null,null,null,null,"","",null,null,null,null,null,null,null,null,null,null,null,null,null,null,null,null,null,null,null,null,null,null,null,0,0]
[null,"DESNUTRIDO",0,0,0,null,null,null,null,null,null,null,null,null,null,null,null,null,null,null,null,null,null,null,null,"",null,null,null,null,null,null,null,null,null,null,null,null,null,null,null,null,null,null,null,null,null,null,null,null,null,null,null,null,null,null,null,null,null,null,null,null,null,null,null,null,null,null,null,null,null,null,null,null,"","",null,null,null,null,null,null,null,null,null,null,null,null,null,null,null,null,null,null,null,null,null,null,null,0,0]
[null,"SOBREPESO / RIESGO OBESIDAD",0,0,0,null,null,null,null,null,null,null,null,null,null,null,null,null,null,null,null,null,null,null,null,"",null,null,null,null,null,null,null,null,null,null,null,null,null,null,null,null,null,null,null,null,null,null,null,null,null,null,null,null,null,null,null,null,null,null,null,null,null,null,null,null,null,null,null,null,null,null,null,null,"","",null,null,null,null,null,null,null,null,null,null,null,null,null,null,null,null,null,null,null,null,null,null,null,0,0]
[null,"OBESO",0,0,0,null,null,null,null,null,null,null,null,null,null,null,null,null,null,null,null,null,null,null,null,"",null,null,null,null,null,null,null,null,null,null,null,null,null,null,null,null,null,null,null,null,null,null,null,null,null,null,null,null,null,null,null,null,null,null,null,null,null,null,null,null,null,null,null,null,null,null,null,null,"","",null,null,null,null,null,null,null,null,null,null,null,null,null,null,null,null,null,null,null,null,null,null,null,0,0]
[null,"NORMAL",0,0,0,null,null,null,null,null,null,null,null,null,null,null,null,null,null,null,null,null,null,null,null,"",null,null,null,null,null,null,null,null,null,null,null,null,null,null,null,null,null,null,null,null,null,null,null,null,null,null,null,null,null,null,null,null,null,null,null,null,null,null,null,null,null,null,null,null,null,null,null,null,"","",null,null,null,null,null,null,null,null,null,null,null,null,null,null,null,null,null,null,null,null,null,null,null,0,0]
[null,"SUBTOTAL",{"$f":"SUM(D36:E36)","v":0},{"$f":"+F36+H36+J36+L36+N36+P36+R36+T36","v":0},{"$f":"+G36+I36+K36+M36+O36+Q36+S36+U36","v":0},{"$f":"SUM(F31:F35)","v":0},0,0,0,0,0,0,0,0,0,0,0,0,0,0,0,0,0,{"$f":"SUM(X31:X35)","v":0},0,{"$f":"\"\" & BP36 & BQ36","v":""},null,null,null,null,null,null,null,null,null,null,null,null,null,null,null,null,null,null,null,null,null,null,null,null,null,null,null,null,null,null,null,null,null,null,null,null,null,null,null,null,null,{"$f":"IF($C36>=$T36+$U36,\"\",\"* El Total de Pueblos Originarios no debe ser mayor al Total Indicador peso/talla. \")","v":""},{"$f":"IF($C36>=$V36+$W36,\"\",\"* El Total de Población Migrantes no debe ser mayor al Total Indicador peso/talla. \")","v":""},null,null,null,null,null,null,null,null,null,null,null,null,null,null,null,null,null,null,null,null,null,null,null,{"$f":"IF($C36>=$T36+$U36,0,1)","v":0},{"$f":"IF($C36>=$V36+$W36,0,1)","v":0}]
[null,"DESNUTRICIÓN \nSECUNDARIA",0,{"$f":"+F37+H37+J37+L37+N37+P37+R37+T37","v":0},{"$f":"+G37+I37+K37+M37+O37+Q37+S37+U37","v":0},null,null,null,null,null,null,null,null,null,null,null,null,null,null,null,null,null,null,null,null,{"$f":"BW37 & BX37","v":""},null,null,null,null,null,null,null,null,null,null,null,null,null,null,null,null,null,null,null,null,null,null,null,null,null,null,null,null,null,null,null,null,null,null,null,null,null,null,null,null,null,null,null,null,null,null,null,null,{"$f":"IF(AND(D37<>0,T37=\"\"), \"* No olvide escribir en la celda de Pueblos Originarios (Digite CERO si no tiene). \",IF(AND(E37<>0,U37=\"\"), \"* No olvide escribir en la celda de Pueblos Originarios (Digite CERO si no tiene). \",\"\"))","v":""},{"$f":"IF(AND(D37<>0,V37=\"\"), \"* No olvide escribir en la celda de Población Migrantes (Digite CERO si no tiene). \",IF(AND(E37<>0,W37=\"\"), \"* No olvide escribir en la celda de Población Migrantes (Digite CERO si no tiene). \",\"\"))","v":""},null,null,null,null,null,null,null,null,null,null,null,null,null,null,null,null,null,null,null,null,null,null,null,{"$f":"IF(AND(D37<>0,T37=\"\"), 1,IF(AND(E37<>0,U37=\"\"), 1,0))","v":0},{"$f":"IF(AND(D37<>0,V37=\"\"), 1,IF(AND(E37<>0,W37=\"\"), 1,0))","v":0}]
[null,"NIÑOS SIN EVALUACIÓN NUTRICIONAL CON CONDICIÓN ESPECIAL DE SALUD",0,0,0]
[null,"T O T A L",{"$f":"SUM(D39:E39)","v":0},null,null,{"$f":"SUM(F31:F35)+F37","v":0},0,0,0,0,0,0,0,0,0,0,0,0,0,0,0,0,0,{"$f":"SUM(X31:X35)+X37","v":0},0,{"$f":"\"\" & BP39 & BQ39","v":""},null,null,null,null,null,null,null,null,null,null,null,null,null,null,null,null,null,null,null,null,null,null,null,null,null,null,null,null,null,null,null,null,null,null,null,null,null,null,null,null,null,{"$f":"IF($C39>=$T39+$U39,\"\",\"* El Total de Pueblos Originarios no debe ser mayor al Total Indicador peso/talla. \")","v":""},{"$f":"IF($C39>=$V39+$W39,\"\",\"* El Total de Población Migrantes no debe ser mayor al Total Indicador peso/talla. \")","v":""},null,null,null,null,null,null,null,null,null,null,null,null,null,null,null,null,null,null,null,null,null,null,null,{"$f":"IF($C39>=$T39+$U39,0,1)","v":0},{"$f":"IF($C39>=$V39+$W39,0,1)","v":0}]
["SECCION A.1: POBLACIÓN EN CONTROL, SEGÚN ESTADO NUTRICIONAL PARA NIÑOS AS DE 61 MESES - 9 AÑOS 11 MESES"]
["INDICADOR NUTRICIONAL\nY\nPARÁMETROS DE MEDICIÓN",null,"TOTAL",null,null,"GRUPOS DE EDAD (en meses - años) Y SEXO"]
[null,null,null,null,null,"61 a 71 meses",null,"6 a 6 años 11 meses",null,"7 a 7 años 11 meses",null,"8 a 8 años 11 meses",null,"9 a 9 años 11 meses",null,"Pueblos Originarios",null,"Población Migrantes"]
[null,null,"Ambos sexos","Hombres","Mujeres","Hombres","Mujeres","Hombres","Mujeres","Hombres","Mujeres","Hombres","Mujeres","Hombres","Mujeres","Hombres","Mujeres","Hombres","Mujeres"]
["TOTAL DE NIÑOS EN CONTROL",null,{"$f":"+D44+E44","v":0},{"$f":"+F44+H44+J44+L44+N44","v":0},{"$f":"+G44+I44+K44+M44+O44","v":0},null,null,null,null,null,null,null,null,null,null,null,null,null,null,{"$f":"CH44 & CI44 & CJ44 & CK44 & CL44 & CM44 & CO44 & CP44","v":""},null,null,null,null,null,null,null,null,null,null,null,null,null,null,null,null,null,null,null,null,null,null,null,null,null,null,null,null,null,null,null,null,null,null,null,null,null,null,null,null,null,null,null,null,null,null,null,null,null,null,null,null,null,null,null,null,null,null,null,null,null,null,null,null,null,{"$f":"IF(F44<>F73,\"* El Total de niños en control no debe ser distinto al total del Diagnóstico Nutricional Integrado. \",\"\")","v":""},{"$f":"IF(G44<>G73,\"* El Total de niñas en control no debe ser distinto al total del Diagnóstico Nutricional Integrado. \",\"\")","v":""},{"$f":"IF(N44<>N73,\"* El Total de niños en control no debe ser distinto al total del Diagnóstico Nutricional Integrado. \",\"\")","v":""},{"$f":"IF(O44<>O73,\"* El Total de niñas en control no debe ser distinto al total del Diagnóstico Nutricional Integrado. \",\"\")","v":""},{"$f":"IF($C44>=$P44+$Q44,\"\",\"* El Total de Pueblos Originarios no debe ser mayor al total de niños en control. \")","v":""},{"$f":"IF($C44>=$R44+$S44,\"\",\"* El Total de Pueblación Migrantes no debe ser mayor al total de niños en control. \")","v":""},null,{"$f":"IF(AND(D44<>0,P44=\"\"), \"* No olvide escribir en la celda de Pueblos Originarios (Digite CERO si no tiene). \",IF(AND(E44<>0,Q44=\"\"), \"* No olvide escribir en la celda de Pueblos Originarios (Digite CERO si no tiene). \",\"\"))","v":""},{"$f":"IF(AND(D44<>0,R44=\"\"), \"* No olvide escribir en la celda de Población Migrantes (Digite CERO si no tiene). \",IF(AND(E44<>0,S44=\"\"), \"* No olvide escribir en la celda de Población Migrantes (Digite CERO si no tiene). \",\"\"))","v":""},null,null,null,null,null,null,null,null,null,null,null,null,null,null,null,null,{"$f":"IF(F44<>F73,1,0)","v":0},{"$f":"IF(G44<>G73,1,0)","v":0},{"$f":"IF(N44<>N73,1,0)","v":0},{"$f":"IF(O44<>O73,1,0)","v":0},{"$f":"IF($C44>=$P44+$Q44,0,1)","v":0},{"$f":"IF($C44>=$R44+$S44,0,1)","v":0},null,{"$f":"IF(AND(D44<>0,P44=\"\"), 1,IF(AND(E44<>0,Q44=\"\"), 1,0))","v":0},{"$f":"IF(AND(D44<>0,R44=\"\"), 1,IF(AND(E44<>0,S44=\"\"), 1,0))","v":0}]
["INDICADOR IMC / EDAD","+ 3 D.S. (>= 3 )",{"$f":"+D45+E45","v":0},{"$f":"+F45+H45+J45+L45+N45","v":0},{"$f":"+G45+I45+K45+M45+O45","v":0},null,null,null,null,null,null,null,null,null,null,null,null,null,null,{"$f":"CO45 & CP45","v":""},null,null,null,null,null,null,null,null,null,null,null,null,null,null,null,null,null,null,null,null,null,null,null,null,null,null,null,null,null,null,null,null,null,null,null,null,null,null,null,null,null,null,null,null,null,null,null,null,null,null,null,null,null,null,null,null,null,null,null,null,null,null,null,null,null,null,null,null,null,null,null,null,{"$f":"IF(AND(D45<>0,P45=\"\"), \"* No olvide escribir en la celda de Pueblos Originarios (Digite CERO si no tiene). \",IF(AND(E45<>0,Q45=\"\"), \"* No olvide escribir en la celda de Pueblos Originarios (Digite CERO si no tiene). \",\"\"))","v":""},{"$f":"IF(AND(D45<>0,R45=\"\"), \"* No olvide escribir en la celda de Población Migrantes (Digite CERO si no tiene). \",IF(AND(E45<>0,S45=\"\"), \"* No olvide escribir en la celda de Población Migrantes (Digite CERO si no tiene). \",\"\"))","v":""},null,null,null,null,null,null,null,null,null,null,null,null,null,null,null,null,null,null,null,null,null,null,null,{"$f":"IF(AND(D45<>0,P45=\"\"), 1,IF(AND(E45<>0,Q45=\"\"), 1,0))","v":0},{"$f":"IF(AND(D45<>0,R45=\"\"), 1,IF(AND(E45<>0,S45=\"\"), 1,0))","v":0}]
[null,"+ 2 D.S. (>= +2.0 a +2.9)",{"$f":"+D46+E46","v":0},0,0,null,null,null,null,null,null,null,null,null,null,null,null,null,null,{"$f":"CO46 & CP46","v":""},null,null,null,null,null,null,null,null,null,null,null,null,null,null,null,null,null,null,null,null,null,null,null,null,null,null,null,null,null,null,null,null,null,null,null,null,null,null,null,null,null,null,null,null,null,null,null,null,null,null,null,null,null,null,null,null,null,null,null,null,null,null,null,null,null,null,null,null,null,null,null,null,{"$f":"IF(AND(D46<>0,P46=\"\"), \"* No olvide escribir en la celda de Pueblos Originarios (Digite CERO si no tiene). \",IF(AND(E46<>0,Q46=\"\"), \"* No olvide escribir en la celda de Pueblos Originarios (Digite CERO si no tiene). \",\"\"))","v":""},{"$f":"IF(AND(D46<>0,R46=\"\"), \"* No olvide escribir en la celda de Población Migrantes (Digite CERO si no tiene). \",IF(AND(E46<>0,S46=\"\"), \"* No olvide escribir en la celda de Población Migrantes (Digite CERO si no tiene). \",\"\"))","v":""},null,null,null,null,null,null,null,null,null,null,null,null,null,null,null,null,null,null,null,null,null,null,null,{"$f":"IF(AND(D46<>0,P46=\"\"), 1,IF(AND(E46<>0,Q46=\"\"), 1,0))","v":0},{"$f":"IF(AND(D46<>0,R46=\"\"), 1,IF(AND(E46<>0,S46=\"\"), 1,0))","v":0}]
[null,"+ 1 D.S. (>= +1.0 a +1.9)",0,0,0,null,null,null,null,null,null,null,null,null,null,null,null,null,null,{"$f":"CO47 & CP47","v":""},null,null,null,null,null,null,null,null,null,null,null,null,null,null,null,null,null,null,null,null,null,null,null,null,null,null,null,null,null,null,null,null,null,null,null,null,null,null,null,null,null,null,null,null,null,null,null,null,null,null,null,null,null,null,null,null,null,null,null,null,null,null,null,null,null,null,null,null,null,null,null,null,{"$f":"IF(AND(D47<>0,P47=\"\"), \"* No olvide escribir en la celda de Pueblos Originarios (Digite CERO si no tiene). \",IF(AND(E47<>0,Q47=\"\"), \"* No olvide escribir en la celda de Pueblos Originarios (Digite CERO si no tiene). \",\"\"))","v":""},{"$f":"IF(AND(D47<>0,R47=\"\"), \"* No olvide escribir en la celda de Población Migrantes (Digite CERO si no tiene). \",IF(AND(E47<>0,S47=\"\"), \"* No olvide escribir en la celda de Población Migrantes (Digite CERO si no tiene). \",\"\"))","v":""},null,null,null,null,null,null,null,null,null,null,null,null,null,null,null,null,null,null,null,null,null,null,null,{"$f":"IF(AND(D47<>0,P47=\"\"), 1,IF(AND(E47<>0,Q47=\"\"), 1,0))","v":0},{"$f":"IF(AND(D47<>0,R47=\"\"), 1,IF(AND(E47<>0,S47=\"\"), 1,0))","v":0}]
[null,"TOTAL",0,{"$f":"+F48+H48+J48+L48+N48","v":0},{"$f":"+G48+I48+K48+M48+O48","v":0},{"$f":"SUM(F45:F47)","v":0},{"$f":"SUM(G45:G47)","v":0},0,0,0,0,0,0,0,0,{"$f":"SUM(P45:P47)","v":0},0,0,0,{"$f":" CL48 & CM48","v":""},null,null,null,null,null,null,null,null,null,null,null,null,null,null,null,null,null,null,null,null,null,null,null,null,null,null,null,null,null,null,null,null,null,null,null,null,null,null,null,null,null,null,null,null,null,null,null,null,null,null,null,null,null,null,null,null,null,null,null,null,null,null,null,null,null,null,null,null,null,{"$f":"IF($C48>=$P48+$Q48,\"\",\"* El Total de Pueblos Originarios no debe ser mayor al total de niños en control. \")","v":""},{"$f":"IF($C48>=$R48+$S48,\"\",\"* El Total de Pueblación Migrantes no debe ser mayor al total de niños en control. \")","v":""},null,null,null,null,null,null,null,null,null,null,null,null,null,null,null,null,null,null,null,null,null,null,null,{"$f":"IF($C48>=$P48+$Q48,0,1)","v":0},{"$f":"IF($C48>=$R48+$S48,0,1)","v":0}]
[null,"- 1 D.S. (<= -1.0 a -1.9)",0,{"$f":"+F49+H49+J49+L49+N49","v":0},{"$f":"+G49+I49+K49+M49+O49","v":0},null,null,null,null,null,null,null,null,null,null,null,null,null,null,{"$f":"CO49 & CP49","v":""},null,null,null,null,null,null,null,null,null,null,null,null,null,null,null,null,null,null,null,null,null,null,null,null,null,null,null,null,null,null,null,null,null,null,null,null,null,null,null,null,null,null,null,null,null,null,null,null,null,null,null,null,null,null,null,null,null,null,null,null,null,null,null,null,null,null,null,null,null,null,null,null,{"$f":"IF(AND(D49<>0,P49=\"\"), \"* No olvide escribir en la celda de Pueblos Originarios (Digite CERO si no tiene). \",IF(AND(E49<>0,Q49=\"\"), \"* No olvide escribir en la celda de Pueblos Originarios (Digite CERO si no tiene). \",\"\"))","v":""},{"$f":"IF(AND(D49<>0,R49=\"\"), \"* No olvide escribir en la celda de Población Migrantes (Digite CERO si no tiene). \",IF(AND(E49<>0,S49=\"\"), \"* No olvide escribir en la celda de Población Migrantes (Digite CERO si no tiene). \",\"\"))","v":""},null,null,null,null,null,null,null,null,null,null,null,null,null,null,null,null,null,null,null,null,null,null,null,{"$f":"IF(AND(D49<>0,P49=\"\"), 1,IF(AND(E49<>0,Q49=\"\"), 1,0))","v":0},{"$f":"IF(AND(D49<>0,R49=\"\"), 1,IF(AND(E49<>0,S49=\"\"), 1,0))","v":0}]
[null,"- 2 D.S. (<= -2.0)",{"$f":"+D50+E50","v":0},0,0,null,null,null,null,null,null,null,null,null,null,null,null,null,null,{"$f":"CO50 & CP50","v":""},null,null,null,null,null,null,null,null,null,null,null,null,null,null,null,null,null,null,null,null,null,null,null,null,null,null,null,null,null,null,null,null,null,null,null,null,null,null,null,null,null,null,null,null,null,null,null,null,null,null,null,null,null,null,null,null,null,null,null,null,null,null,null,null,null,null,null,null,null,null,null,null,{"$f":"IF(AND(D50<>0,P50=\"\"), \"* No olvide escribir en la celda de Pueblos Originarios (Digite CERO si no tiene). \",IF(AND(E50<>0,Q50=\"\"), \"* No olvide escribir en la celda de Pueblos Originarios (Digite CERO si no tiene). \",\"\"))","v":""},{"$f":"IF(AND(D50<>0,R50=\"\"), \"* No olvide escribir en la celda de Población Migrantes (Digite CERO si no tiene). \",IF(AND(E50<>0,S50=\"\"), \"* No olvide escribir en la celda de Población Migrantes (Digite CERO si no tiene). \",\"\"))","v":""},null,null,null,null,null,null,null,null,null,null,null,null,null,null,null,null,null,null,null,null,null,null,null,{"$f":"IF(AND(D50<>0,P50=\"\"), 1,IF(AND(E50<>0,Q50=\"\"), 1,0))","v":0},{"$f":"IF(AND(D50<>0,R50=\"\"), 1,IF(AND(E50<>0,S50=\"\"), 1,0))","v":0}]
[null,"TOTAL",0,{"$f":"+F51+H51+J51+L51+N51","v":0},{"$f":"+G51+I51+K51+M51+O51","v":0},{"$f":"SUM(F49:F50)","v":0},{"$f":"SUM(G49:G50)","v":0},0,0,0,0,0,0,0,0,{"$f":"SUM(P49:P50)","v":0},0,0,0,{"$f":" CL51 & CM51","v":""},null,null,null,null,null,null,null,null,null,null,null,null,null,null,null,null,null,null,null,null,null,null,null,null,null,null,null,null,null,null,null,null,null,null,null,null,null,null,null,null,null,null,null,null,null,null,null,null,null,null,null,null,null,null,null,null,null,null,null,null,null,null,null,null,null,null,null,null,null,{"$f":"IF($C51>=$P51+$Q51,\"\",\"* El Total de Pueblos Originarios no debe ser mayor al total de niños en control. \")","v":""},{"$f":"IF($C51>=$R51+$S51,\"\",\"* El Total de Pueblación Migrantes no debe ser mayor al total de niños en control. \")","v":""},null,null,null,null,null,null,null,null,null,null,null,null,null,null,null,null,null,null,null,null,null,null,null,{"$f":"IF($C51>=$P51+$Q51,0,1)","v":0},{"$f":"IF($C51>=$R51+$S51,0,1)","v":0}]
[null,"PROMEDIO (-0,9 A + 0,9)",0,{"$f":"+F52+N52","v":0},{"$f":"+G52+I52+K52+M52+O52","v":0},null,null,null,null,null,null,null,null,null,null,null,null,null,null,{"$f":"CO52 & CP52","v":""},null,null,null,null,null,null,null,null,null,null,null,null,null,null,null,null,null,null,null,null,null,null,null,null,null,null,null,null,null,null,null,null,null,null,null,null,null,null,null,null,null,null,null,null,null,null,null,null,null,null,null,null,null,null,null,null,null,null,null,null,null,null,null,null,null,null,null,null,null,null,null,null,{"$f":"IF(AND(D52<>0,P52=\"\"), \"* No olvide escribir en la celda de Pueblos Originarios (Digite CERO si no tiene). \",IF(AND(E52<>0,Q52=\"\"), \"* No olvide escribir en la celda de Pueblos Originarios (Digite CERO si no tiene). \",\"\"))","v":""},{"$f":"IF(AND(D52<>0,R52=\"\"), \"* No olvide escribir en la celda de Población Migrantes (Digite CERO si no tiene). \",IF(AND(E52<>0,S52=\"\"), \"* No olvide escribir en la celda de Población Migrantes (Digite CERO si no tiene). \",\"\"))","v":""},null,null,null,null,null,null,null,null,null,null,null,null,null,null,null,null,null,null,null,null,null,null,null,{"$f":"IF(AND(D52<>0,P52=\"\"), 1,IF(AND(E52<>0,Q52=\"\"), 1,0))","v":0},{"$f":"IF(AND(D52<>0,R52=\"\"), 1,IF(AND(E52<>0,S52=\"\"), 1,0))","v":0}]
["INDICADOR TALLA/EDAD","+ 2 D.S. (>= +2.0)",0,{"$f":"+F53+H53+J53+L53+N53","v":0},0,null,null,null,null,null,null,null,null,null,null,null,null,null,null,{"$f":"CO53 & CP53","v":""},null,null,null,null,null,null,null,null,null,null,null,null,null,null,null,null,null,null,null,null,null,null,null,null,null,null,null,null,null,null,null,null,null,null,null,null,null,null,null,null,null,null,null,null,null,null,null,null,null,null,null,null,null,null,null,null,null,null,null,null,null,null,null,null,null,null,null,null,null,null,null,null,{"$f":"IF(AND(D53<>0,P53=\"\"), \"* No olvide escribir en la celda de Pueblos Originarios (Digite CERO si no tiene). \",IF(AND(E53<>0,Q53=\"\"), \"* No olvide escribir en la celda de Pueblos Originarios (Digite CERO si no tiene). \",\"\"))","v":""},{"$f":"IF(AND(D53<>0,R53=\"\"), \"* No olvide escribir en la celda de Población Migrantes (Digite CERO si no tiene). \",IF(AND(E53<>0,S53=\"\"), \"* No olvide escribir en la celda de Población Migrantes (Digite CERO si no tiene). \",\"\"))","v":""},null,null,null,null,null,null,null,null,null,null,null,null,null,null,null,null,null,null,null,null,null,null,null,{"$f":"IF(AND(D53<>0,P53=\"\"), 1,IF(AND(E53<>0,Q53=\"\"), 1,0))","v":0},{"$f":"IF(AND(D53<>0,R53=\"\"), 1,IF(AND(E53<>0,S53=\"\"), 1,0))","v":0}]
[null,"+ 1 D.S. (+1.0 a +1.9)",0,0,0,null,null,null,null,null,null,null,null,null,null,null,null,null,null,{"$f":"CO54 & CP54","v":""},null,null,null,null,null,null,null,null,null,null,null,null,null,null,null,null,null,null,null,null,null,null,null,null,null,null,null,null,null,null,null,null,null,null,null,null,null,null,null,null,null,null,null,null,null,null,null,null,null,null,null,null,null,null,null,null,null,null,null,null,null,null,null,null,null,null,null,null,null,null,null,null,{"$f":"IF(AND(D54<>0,P54=\"\"), \"* No olvide escribir en la celda de Pueblos Originarios (Digite CERO si no tiene). \",IF(AND(E54<>0,Q54=\"\"), \"* No olvide escribir en la celda de Pueblos Originarios (Digite CERO si no tiene). \",\"\"))","v":""},{"$f":"IF(AND(D54<>0,R54=\"\"), \"* No olvide escribir en la celda de Población Migrantes (Digite CERO si no tiene). \",IF(AND(E54<>0,S54=\"\"), \"* No olvide escribir en la celda de Población Migrantes (Digite CERO si no tiene). \",\"\"))","v":""},null,null,null,null,null,null,null,null,null,null,null,null,null,null,null,null,null,null,null,null,null,null,null,{"$f":"IF(AND(D54<>0,P54=\"\"), 1,IF(AND(E54<>0,Q54=\"\"), 1,0))","v":0},{"$f":"IF(AND(D54<>0,R54=\"\"), 1,IF(AND(E54<>0,S54=\"\"), 1,0))","v":0}]
[null,"TOTAL",0,{"$f":"+F55+H55+J55+L55+N55","v":0},{"$f":"+G55+I55+K55+M55+O55","v":0},{"$f":"SUM(F53:F54)","v":0},{"$f":"SUM(G53:G54)","v":0},{"$f":"SUM(H53:H54)","v":0},0,{"$f":"SUM(J53:J54)","v":0},0,{"$f":"SUM(L53:L54)","v":0},0,0,0,0,0,0,0,{"$f":" CL55 & CM55","v":""},null,null,null,null,null,null,null,null,null,null,null,null,null,null,null,null,null,null,null,null,null,null,null,null,null,null,null,null,null,null,null,null,null,null,null,null,null,null,null,null,null,null,null,null,null,null,null,null,null,null,null,null,null,null,null,null,null,null,null,null,null,null,null,null,null,null,null,null,null,{"$f":"IF($C55>=$P55+$Q55,\"\",\"* El Total de Pueblos Originarios no debe ser mayor al total de niños en control. \")","v":""},{"$f":"IF($C55>=$R55+$S55,\"\",\"* El Total de Pueblación Migrantes no debe ser mayor al total de niños en control. \")","v":""},null,null,null,null,null,null,null,null,null,null,null,null,null,null,null,null,null,null,null,null,null,null,null,{"$f":"IF($C55>=$P55+$Q55,0,1)","v":0},{"$f":"IF($C55>=$R55+$S55,0,1)","v":0}]
[null,"- 1 D.S. (-1.0 a -1.9)",0,{"$f":"+F56+H56+J56+L56+N56","v":0},{"$f":"+G56+I56+K56+M56+O56","v":0},null,null,null,null,null,null,null,null,null,null,null,null,null,null,{"$f":"CO56 & CP56","v":""},null,null,null,null,null,null,null,null,null,null,null,null,null,null,null,null,null,null,null,null,null,null,null,null,null,null,null,null,null,null,null,null,null,null,null,null,null,null,null,null,null,null,null,null,null,null,null,null,null,null,null,null,null,null,null,null,null,null,null,null,null,null,null,null,null,null,null,null,null,null,null,null,{"$f":"IF(AND(D56<>0,P56=\"\"), \"* No olvide escribir en la celda de Pueblos Originarios (Digite CERO si no tiene). \",IF(AND(E56<>0,Q56=\"\"), \"* No olvide escribir en la celda de Pueblos Originarios (Digite CERO si no tiene). \",\"\"))","v":""},{"$f":"IF(AND(D56<>0,R56=\"\"), \"* No olvide escribir en la celda de Población Migrantes (Digite CERO si no tiene). \",IF(AND(E56<>0,S56=\"\"), \"* No olvide escribir en la celda de Población Migrantes (Digite CERO si no tiene). \",\"\"))","v":""},null,null,null,null,null,null,null,null,null,null,null,null,null,null,null,null,null,null,null,null,null,null,null,{"$f":"IF(AND(D56<>0,P56=\"\"), 1,IF(AND(E56<>0,Q56=\"\"), 1,0))","v":0},{"$f":"IF(AND(D56<>0,R56=\"\"), 1,IF(AND(E56<>0,S56=\"\"), 1,0))","v":0}]
[null,"- 2 D.S. (<= -2.0)",0,0,0,null,null,null,null,null,null,null,null,null,null,null,null,null,null,{"$f":"CO57 & CP57","v":""},null,null,null,null,null,null,null,null,null,null,null,null,null,null,null,null,null,null,null,null,null,null,null,null,null,null,null,null,null,null,null,null,null,null,null,null,null,null,null,null,null,null,null,null,null,null,null,null,null,null,null,null,null,null,null,null,null,null,null,null,null,null,null,null,null,null,null,null,null,null,null,null,{"$f":"IF(AND(D57<>0,P57=\"\"), \"* No olvide escribir en la celda de Pueblos Originarios (Digite CERO si no tiene). \",IF(AND(E57<>0,Q57=\"\"), \"* No olvide escribir en la celda de Pueblos Originarios (Digite CERO si no tiene). \",\"\"))","v":""},{"$f":"IF(AND(D57<>0,R57=\"\"), \"* No olvide escribir en la celda de Población Migrantes (Digite CERO si no tiene). \",IF(AND(E57<>0,S57=\"\"), \"* No olvide escribir en la celda de Población Migrantes (Digite CERO si no tiene). \",\"\"))","v":""},null,null,null,null,null,null,null,null,null,null,null,null,null,null,null,null,null,null,null,null,null,null,null,{"$f":"IF(AND(D57<>0,P57=\"\"), 1,IF(AND(E57<>0,Q57=\"\"), 1,0))","v":0},{"$f":"IF(AND(D57<>0,R57=\"\"), 1,IF(AND(E57<>0,S57=\"\"), 1,0))","v":0}]
[null,"TOTAL",0,{"$f":"+F58+H58+J58+L58+N58","v":0},{"$f":"+G58+I58+K58+M58+O58","v":0},{"$f":"SUM(F56:F57)","v":0},{"$f":"SUM(G56:G57)","v":0},{"$f":"SUM(H56:H57)","v":0},0,{"$f":"SUM(J56:J57)","v":0},0,{"$f":"SUM(L56:L57)","v":0},0,0,0,{"$f":"SUM(P56:P57)","v":0},0,0,0,{"$f":" CL58 & CM58","v":""},null,null,null,null,null,null,null,null,null,null,null,null,null,null,null,null,null,null,null,null,null,null,null,null,null,null,null,null,null,null,null,null,null,null,null,null,null,null,null,null,null,null,null,null,null,null,null,null,null,null,null,null,null,null,null,null,null,null,null,null,null,null,null,null,null,null,null,null,null,{"$f":"IF($C58>=$P58+$Q58,\"\",\"* El Total de Pueblos Originarios no debe ser mayor al total de niños en control. \")","v":""},{"$f":"IF($C58>=$R58+$S58,\"\",\"* El Total de Pueblación Migrantes no debe ser mayor al total de niños en control. \")","v":""},null,null,null,null,null,null,null,null,null,null,null,null,null,null,null,null,null,null,null,null,null,null,null,{"$f":"IF($C58>=$P58+$Q58,0,1)","v":0},{"$f":"IF($C58>=$R58+$S58,0,1)","v":0}]
[null,"PROMEDIO (-0,9 A + 0,9)",0,{"$f":"+F59+H59+J59+L59+N59","v":0},{"$f":"+G59+I59+K59+M59+O59","v":0},null,null,null,null,null,null,null,null,null,null,null,null,null,null,{"$f":"CO59 & CP59","v":""},null,null,null,null,null,null,null,null,null,null,null,null,null,null,null,null,null,null,null,null,null,null,null,null,null,null,null,null,null,null,null,null,null,null,null,null,null,null,null,null,null,null,null,null,null,null,null,null,null,null,null,null,null,null,null,null,null,null,null,null,null,null,null,null,null,null,null,null,null,null,null,null,{"$f":"IF(AND(D59<>0,P59=\"\"), \"* No olvide escribir en la celda de Pueblos Originarios (Digite CERO si no tiene). \",IF(AND(E59<>0,Q59=\"\"), \"* No olvide escribir en la celda de Pueblos Originarios (Digite CERO si no tiene). \",\"\"))","v":""},{"$f":"IF(AND(D59<>0,R59=\"\"), \"* No olvide escribir en la celda de Población Migrantes (Digite CERO si no tiene). \",IF(AND(E59<>0,S59=\"\"), \"* No olvide escribir en la celda de Población Migrantes (Digite CERO si no tiene). \",\"\"))","v":""},null,null,null,null,null,null,null,null,null,null,null,null,null,null,null,null,null,null,null,null,null,null,null,{"$f":"IF(AND(D59<>0,P59=\"\"), 1,IF(AND(E59<>0,Q59=\"\"), 1,0))","v":0},{"$f":"IF(AND(D59<>0,R59=\"\"), 1,IF(AND(E59<>0,S59=\"\"), 1,0))","v":0}]
["INDICADOR PERIMETRO DE CINTURA / EDAD","NORMAL (<p75)",0,0,0,null,null,null,null,null,null,null,null,null,null,null,null,null,null,{"$f":"CO60 & CP60","v":""},null,null,null,null,null,null,null,null,null,null,null,null,null,null,null,null,null,null,null,null,null,null,null,null,null,null,null,null,null,null,null,null,null,null,null,null,null,null,null,null,null,null,null,null,null,null,null,null,null,null,null,null,null,null,null,null,null,null,null,null,null,null,null,null,null,null,null,null,null,null,null,null,{"$f":"IF(AND(D60<>0,P60=\"\"), \"* No olvide escribir en la celda de Pueblos Originarios (Digite CERO si no tiene). \",IF(AND(E60<>0,Q60=\"\"), \"* No olvide escribir en la celda de Pueblos Originarios (Digite CERO si no tiene). \",\"\"))","v":""},{"$f":"IF(AND(D60<>0,R60=\"\"), \"* No olvide escribir en la celda de Población Migrantes (Digite CERO si no tiene). \",IF(AND(E60<>0,S60=\"\"), \"* No olvide escribir en la celda de Población Migrantes (Digite CERO si no tiene). \",\"\"))","v":""},null,null,null,null,null,null,null,null,null,null,null,null,null,null,null,null,null,null,null,null,null,null,null,{"$f":"IF(AND(D60<>0,P60=\"\"), 1,IF(AND(E60<>0,Q60=\"\"), 1,0))","v":0},{"$f":"IF(AND(D60<>0,R60=\"\"), 1,IF(AND(E60<>0,S60=\"\"), 1,0))","v":0}]
[null,"RIESGO DE OBESIDAD ABDOMINAL (75<p<90)",0,0,0,null,null,null,null,null,null,null,null,null,null,null,null,null,null,{"$f":"CO61 & CP61","v":""},null,null,null,null,null,null,null,null,null,null,null,null,null,null,null,null,null,null,null,null,null,null,null,null,null,null,null,null,null,null,null,null,null,null,null,null,null,null,null,null,null,null,null,null,null,null,null,null,null,null,null,null,null,null,null,null,null,null,null,null,null,null,null,null,null,null,null,null,null,null,null,null,{"$f":"IF(AND(D61<>0,P61=\"\"), \"* No olvide escribir en la celda de Pueblos Originarios (Digite CERO si no tiene). \",IF(AND(E61<>0,Q61=\"\"), \"* No olvide escribir en la celda de Pueblos Originarios (Digite CERO si no tiene). \",\"\"))","v":""},{"$f":"IF(AND(D61<>0,R61=\"\"), \"* No olvide escribir en la celda de Población Migrantes (Digite CERO si no tiene). \",IF(AND(E61<>0,S61=\"\"), \"* No olvide escribir en la celda de Población Migrantes (Digite CERO si no tiene). \",\"\"))","v":""},null,null,null,null,null,null,null,null,null,null,null,null,null,null,null,null,null,null,null,null,null,null,null,{"$f":"IF(AND(D61<>0,P61=\"\"), 1,IF(AND(E61<>0,Q61=\"\"), 1,0))","v":0},{"$f":"IF(AND(D61<>0,R61=\"\"), 1,IF(AND(E61<>0,S61=\"\"), 1,0))","v":0}]
[null,"OBESIDAD ABDOMINAL (>p90)",0,0,0,null,null,null,null,null,null,null,null,null,null,null,null,null,null,{"$f":"CO62 & CP62","v":""},null,null,null,null,null,null,null,null,null,null,null,null,null,null,null,null,null,null,null,null,null,null,null,null,null,null,null,null,null,null,null,null,null,null,null,null,null,null,null,null,null,null,null,null,null,null,null,null,null,null,null,null,null,null,null,null,null,null,null,null,null,null,null,null,null,null,null,null,null,null,null,null,{"$f":"IF(AND(D62<>0,P62=\"\"), \"* No olvide escribir en la celda de Pueblos Originarios (Digite CERO si no tiene). \",IF(AND(E62<>0,Q62=\"\"), \"* No olvide escribir en la celda de Pueblos Originarios (Digite CERO si no tiene). \",\"\"))","v":""},{"$f":"IF(AND(D62<>0,R62=\"\"), \"* No olvide escribir en la celda de Población Migrantes (Digite CERO si no tiene). \",IF(AND(E62<>0,S62=\"\"), \"* No olvide escribir en la celda de Población Migrantes (Digite CERO si no tiene). \",\"\"))","v":""},null,null,null,null,null,null,null,null,null,null,null,null,null,null,null,null,null,null,null,null,null,null,null,{"$f":"IF(AND(D62<>0,P62=\"\"), 1,IF(AND(E62<>0,Q62=\"\"), 1,0))","v":0},{"$f":"IF(AND(D62<>0,R62=\"\"), 1,IF(AND(E62<>0,S62=\"\"), 1,0))","v":0}]
[null,"TOTAL",{"$f":"+D63+E63","v":0},{"$f":"+F63+H63+J63+L63+N63","v":0},{"$f":"+G63+I63+K63+M63+O63","v":0},{"$f":"SUM(F60:F62)","v":0},{"$f":"SUM(G60:G62)","v":0},{"$f":"SUM(H60:H62)","v":0},0,{"$f":"SUM(J60:J62)","v":0},0,{"$f":"SUM(L60:L62)","v":0},0,0,0,{"$f":"SUM(P60:P62)","v":0},0,0,{"$f":"SUM(S60:S62)","v":0},{"$f":" CL63 & CM63","v":""},null,null,null,null,null,null,null,null,null,null,null,null,null,null,null,null,null,null,null,null,null,null,null,null,null,null,null,null,null,null,null,null,null,null,null,null,null,null,null,null,null,null,null,null,null,null,null,null,null,null,null,null,null,null,null,null,null,null,null,null,null,null,null,null,null,null,null,null,null,{"$f":"IF($C63>=$P63+$Q63,\"\",\"* El Total de Pueblos Originarios no debe ser mayor al total de niños en control. \")","v":""},{"$f":"IF($C63>=$R63+$S63,\"\",\"* El Total de Pueblación Migrantes no debe ser mayor al total de niños en control. \")","v":""},null,null,null,null,null,null,null,null,null,null,null,null,null,null,null,null,null,null,null,null,null,null,null,{"$f":"IF($C63>=$P63+$Q63,0,1)","v":0},{"$f":"IF($C63>=$R63+$S63,0,1)","v":0}]
["DIAGNOSTICO NUTRICIONAL INTEGRADO","RIESGO DE DESNUTRIR/ DEFICIT PONDERAL*",0,{"$f":"+F64+H64+J64+L64+N64","v":0},{"$f":"+G64+I64+K64+M64+O64","v":0},null,null,null,null,null,null,null,null,null,null,null,null,null,null,{"$f":"CO64 & CP64","v":""},null,null,null,null,null,null,null,null,null,null,null,null,null,null,null,null,null,null,null,null,null,null,null,null,null,null,null,null,null,null,null,null,null,null,null,null,null,null,null,null,null,null,null,null,null,null,null,null,null,null,null,null,null,null,null,null,null,null,null,null,null,null,null,null,null,null,null,null,null,null,null,null,{"$f":"IF(AND(D64<>0,P64=\"\"), \"* No olvide escribir en la celda de Pueblos Originarios (Digite CERO si no tiene). \",IF(AND(E64<>0,Q64=\"\"), \"* No olvide escribir en la celda de Pueblos Originarios (Digite CERO si no tiene). \",\"\"))","v":""},{"$f":"IF(AND(D64<>0,R64=\"\"), \"* No olvide escribir en la celda de Población Migrantes (Digite CERO si no tiene). \",IF(AND(E64<>0,S64=\"\"), \"* No olvide escribir en la celda de Población Migrantes (Digite CERO si no tiene). \",\"\"))","v":""},null,null,null,null,null,null,null,null,null,null,null,null,null,null,null,null,null,null,null,null,null,null,null,{"$f":"IF(AND(D64<>0,P64=\"\"), 1,IF(AND(E64<>0,Q64=\"\"), 1,0))","v":0},{"$f":"IF(AND(D64<>0,R64=\"\"), 1,IF(AND(E64<>0,S64=\"\"), 1,0))","v":0}]
[null,"DESNUTRIDO",0,0,0,null,null,null,null,null,null,null,null,null,null,null,null,null,null,"",null,null,null,null,null,null,null,null,null,null,null,null,null,null,null,null,null,null,null,null,null,null,null,null,null,null,null,null,null,null,null,null,null,null,null,null,null,null,null,null,null,null,null,null,null,null,null,null,null,null,null,null,null,null,null,null,null,null,null,null,null,null,null,null,null,null,null,null,null,null,null,null,"","",null,null,null,null,null,null,null,null,null,null,null,null,null,null,null,null,null,null,null,null,null,null,null,0,0]
[null,"SOBREPESO / RIESGO OBESIDAD",0,0,0,null,null,null,null,null,null,null,null,null,null,null,null,null,null,"",null,null,null,null,null,null,null,null,null,null,null,null,null,null,null,null,null,null,null,null,null,null,null,null,null,null,null,null,null,null,null,null,null,null,null,null,null,null,null,null,null,null,null,null,null,null,null,null,null,null,null,null,null,null,null,null,null,null,null,null,null,null,null,null,null,null,null,null,null,null,null,null,"","",null,null,null,null,null,null,null,null,null,null,null,null,null,null,null,null,null,null,null,null,null,null,null,0,0]
[null,"OBESO",0,0,0,null,null,null,null,null,null,null,null,null,null,null,null,null,null,"",null,null,null,null,null,null,null,null,null,null,null,null,null,null,null,null,null,null,null,null,null,null,null,null,null,null,null,null,null,null,null,null,null,null,null,null,null,null,null,null,null,null,null,null,null,null,null,null,null,null,null,null,null,null,null,null,null,null,null,null,null,null,null,null,null,null,null,null,null,null,null,null,"","",null,null,null,null,null,null,null,null,null,null,null,null,null,null,null,null,null,null,null,null,null,null,null,0,0]
[null,"OBESO SEVERO",0,0,0,null,null,null,null,null,null,null,null,null,null,null,null,null,null,"",null,null,null,null,null,null,null,null,null,null,null,null,null,null,null,null,null,null,null,null,null,null,null,null,null,null,null,null,null,null,null,null,null,null,null,null,null,null,null,null,null,null,null,null,null,null,null,null,null,null,null,null,null,null,null,null,null,null,null,null,null,null,null,null,null,null,null,null,null,null,null,null,"","",null,null,null,null,null,null,null,null,null,null,null,null,null,null,null,null,null,null,null,null,null,null,null,0,0]
[null,"NORMAL",0,0,{"$f":"+G69+I69+K69+M69+O69","v":0},null,null,null,null,null,null,null,null,null,null,null,null,null,null,"",null,null,null,null,null,null,null,null,null,null,null,null,null,null,null,null,null,null,null,null,null,null,null,null,null,null,null,null,null,null,null,null,null,null,null,null,null,null,null,null,null,null,null,null,null,null,null,null,null,null,null,null,null,null,null,null,null,null,null,null,null,null,null,null,null,null,null,null,null,null,null,null,"","",null,null,null,null,null,null,null,null,null,null,null,null,null,null,null,null,null,null,null,null,null,null,null,0,0]
[null,"SUBTOTAL",{"$f":"+D70+E70","v":0},{"$f":"+F70+H70+J70+L70+N70","v":0},{"$f":"+G70+I70+K70+M70+O70","v":0},{"$f":"SUM(F64:F69)","v":0},{"$f":"SUM(G64:G69)","v":0},{"$f":"SUM(H64:H69)","v":0},0,{"$f":"SUM(J64:J69)","v":0},0,{"$f":"SUM(L64:L69)","v":0},0,0,0,0,0,0,0,{"$f":" CL70 & CM70","v":""},null,null,null,null,null,null,null,null,null,null,null,null,null,null,null,null,null,null,null,null,null,null,null,null,null,null,null,null,null,null,null,null,null,null,null,null,null,null,null,null,null,null,null,null,null,null,null,null,null,null,null,null,null,null,null,null,null,null,null,null,null,null,null,null,null,null,null,null,null,{"$f":"IF($C70>=$P70+$Q70,\"\",\"* El Total de Pueblos Originarios no debe ser mayor al total de niños en control. \")","v":""},{"$f":"IF($C70>=$R70+$S70,\"\",\"* El Total de Pueblación Migrantes no debe ser mayor al total de niños en control. \")","v":""},null,null,null,null,null,null,null,null,null,null,null,null,null,null,null,null,null,null,null,null,null,null,null,{"$f":"IF($C70>=$P70+$Q70,0,1)","v":0},{"$f":"IF($C70>=$R70+$S70,0,1)","v":0}]
[null,"DESNUTRICIÓN \nSECUNDARIA",0,{"$f":"+F71+H71+J71+L71+N71","v":0},{"$f":"+G71+I71+K71+M71+O71","v":0},null,null,null,null,null,null,null,null,null,null,null,null,null,null,{"$f":"CO71 & CP71","v":""},null,null,null,null,null,null,null,null,null,null,null,null,null,null,null,null,null,null,null,null,null,null,null,null,null,null,null,null,null,null,null,null,null,null,null,null,null,null,null,null,null,null,null,null,null,null,null,null,null,null,null,null,null,null,null,null,null,null,null,null,null,null,null,null,null,null,null,null,null,null,null,null,{"$f":"IF(AND(D71<>0,P71=\"\"), \"* No olvide escribir en la celda de Pueblos Originarios (Digite CERO si no tiene). \",IF(AND(E71<>0,Q71=\"\"), \"* No olvide escribir en la celda de Pueblos Originarios (Digite CERO si no tiene). \",\"\"))","v":""},{"$f":"IF(AND(D71<>0,R71=\"\"), \"* No olvide escribir en la celda de Población Migrantes (Digite CERO si no tiene). \",IF(AND(E71<>0,S71=\"\"), \"* No olvide escribir en la celda de Población Migrantes (Digite CERO si no tiene). \",\"\"))","v":""},null,null,null,null,null,null,null,null,null,null,null,null,null,null,null,null,null,null,null,null,null,null,null,{"$f":"IF(AND(D71<>0,P71=\"\"), 1,IF(AND(E71<>0,Q71=\"\"), 1,0))","v":0},{"$f":"IF(AND(D71<>0,R71=\"\"), 1,IF(AND(E71<>0,S71=\"\"), 1,0))","v":0}]
[null,"NIÑOS SIN EVALUACIÓN NUTRICIONAL CON CONDICIÓN ESPECIAL DE SALUD",{"$f":"SUM(D72:E72)","v":0},{"$f":"+F72+H72+J72+L72+N72","v":0},{"$f":"+G72+I72+K72+M72+O72","v":0}]
[null,"T O T A L",{"$f":"SUM(D73:E73)","v":0},{"$f":"SUM(D64:D69)+D71","v":0},0,{"$f":"SUM(F64:F69)+F71","v":0},0,{"$f":"SUM(H64:H69)+H71","v":0},0,{"$f":"SUM(J64:J69)+J71","v":0},0,{"$f":"SUM(L64:L69)+L71","v":0},0,0,0,0,0,0,0,{"$f":" CL73 & CM73","v":""},null,null,null,null,null,null,null,null,null,null,null,null,null,null,null,null,null,null,null,null,null,null,null,null,null,null,null,null,null,null,null,null,null,null,null,null,null,null,null,null,null,null,null,null,null,null,null,null,null,null,null,null,null,null,null,null,null,null,null,null,null,null,null,null,null,null,null,null,null,{"$f":"IF($C73>=$P73+$Q73,\"\",\"* El Total de Pueblos Originarios no debe ser mayor al total de niños en control. \")","v":""},{"$f":"IF($C73>=$R73+$S73,\"\",\"* El Total de Pueblación Migrantes no debe ser mayor al total de niños en control. \")","v":""},null,null,null,null,null,null,null,null,null,null,null,null,null,null,null,null,null,null,null,null,null,null,null,{"$f":"IF($C73>=$P73+$Q73,0,1)","v":0},{"$f":"IF($C73>=$R73+$S73,0,1)","v":0}]
["NOTA(*): El Diagnóstico Nutricional Integrado de Déficit para los niños (as) 5 años y más denomina Déficit Ponderal al Riesgo de Desnutrir."]
["SECCION B: POBLACION EN CONTROL SEGÚN RESULTADO DE EVALUACIÓN DEL DESARROLLO PSICOMOTOR"]
["RESULTADO Y\nGRUPOS DE EDAD",null,"TOTAL","Hombres","Mujeres","Pueblos Originarios","Migrantes"]
["NORMAL","Menor de 12 meses",{"$f":"SUM(D77:E77)","v":0},null,null,null,null,null,null,null,null,null,null,null,null,null,null,null,null,null,null,null,null,null,null,null,null,null,null,null,null,null,null,null,null,null,null,null,null,null,null,null,null,null,null,null,null,null,null,null,null,null,null,null,null,null,null,null,null,null,null,null,null,null,null,null,null,null,null,null,null,null,null,null,null,null,null,null,null,null,null,null,{"$f":"IF($F1+$H1+$J1+$L1+$N1+$P1+$R1+$T1<$D77+$D83,\"* La suma de Población Masculina Menor de 12 meses según resultado de 'Riesgo y Retraso' no puede ser mayor que la Población Masculina bajo control de la sección A. \",\"\")","v":""},{"$f":"IF($G1+$I1+$K1+$M1+$O1+$Q1+$S1+$U1<$E77+$E83,\"* La suma de Población Femenina de Menor de 12 meses según resultado de 'Riesgo y Retraso' no puede ser mayor que la Población Femenina bajo control de la sección A. \",\"\")","v":""},null,null,null,null,null,null,null,null,null,null,null,null,null,null,null,null,null,null,null,null,null,null,null,{"$f":"IF($F1+$H1+$J1+$L1+$N1+$P1+$R1+$T1<$D77+$D83,1,0)","v":0},{"$f":"IF($G1+$I1+$K1+$M1+$O1+$Q1+$S1+$U1<$E77+$E83,1,0)","v":0}]
[null,"12 a 17 meses",{"$f":"SUM(D78:E78)","v":0},null,null,null,null,null,null,null,null,null,null,null,null,null,null,null,null,null,null,null,null,null,null,null,null,null,null,null,null,null,null,null,null,null,null,null,null,null,null,null,null,null,null,null,null,null,null,null,null,null,null,null,null,null,null,null,null,null,null,null,null,null,null,null,null,null,null,null,null,null,null,null,null,null,null,null,null,null,null,null,{"$f":"IF($J$11<$D$90+$D$96,\"* La suma de Población Masculina de 12 a 17 meses según resultado de 'Riesgo y Retraso' no puede ser mayor que la Población Masculina bajo control de la sección A. \",\"\")","v":""},{"$f":"IF($K$11<$E$90+$E$96,\"* La suma de Población Femenina de 12 a 17 meses según resultado de 'Riesgo y Retraso' no puede ser mayor que la Población Femenina bajo control de la sección A. \",\"\")","v":""},null,null,null,null,null,null,null,null,null,null,null,null,null,null,null,null,null,null,null,null,null,null,null,{"$f":"IF($J$11<$D$90+$D$96,1,0)","v":0},{"$f":"IF($K$11<$E$90+$E$96,1,0)","v":0}]
[null,"18 a 23 meses",0,null,null,null,null,null,null,null,null,null,null,null,null,null,null,null,null,null,null,null,null,null,null,null,null,null,null,null,null,null,null,null,null,null,null,null,null,null,null,null,null,null,null,null,null,null,null,null,null,null,null,null,null,null,null,null,null,null,null,null,null,null,null,null,null,null,null,null,null,null,null,null,null,null,null,null,null,null,null,null,{"$f":"IF($L$11<$D$91+$D$97,\"* La suma de Población Masculina de 18 a 23 meses según resultado de 'Riesgo y Retraso' no puede ser mayor que la Población Masculina bajo control de la sección A. \",\"\")","v":""},{"$f":"IF($M$11<$E$91+$E$97,\"* La suma de Población Femenina de 18 a 23 meses según resultado de 'Riesgo y Retraso' no puede ser mayor que la Población Femenina bajo control de la sección A. \",\"\")","v":""},null,null,null,null,null,null,null,null,null,null,null,null,null,null,null,null,null,null,null,null,null,null,null,{"$f":"IF($L$11<$D$91+$D$97,1,0)","v":0},{"$f":"IF($M$11<$E$91+$E$97,1,0)","v":0}]
[null,"24 a 35 meses",0,null,null,null,null,null,null,null,null,null,null,null,null,null,null,null,null,null,null,null,null,null,null,null,null,null,null,null,null,null,null,null,null,null,null,null,null,null,null,null,null,null,null,null,null,null,null,null,null,null,null,null,null,null,null,null,null,null,null,null,null,null,null,null,null,null,null,null,null,null,null,null,null,null,null,null,null,null,null,null,{"$f":"IF($Z1+$AD1+$AB1<$D80+$D86,\"* La suma de Población Masculina de 24 a 47 meses según resultado de 'Riesgo y Retraso' no puede ser mayor que la Población Masculina bajo control de la sección A. \",\"\")","v":""},{"$f":"IF($AA1+$AE1+$AC1<$E80+$E86,\"* La suma de Población Femenina de 24 a 47 meses según resultado de 'Riesgo y Retraso' no puede ser mayor que la Población Femenina bajo control de la sección A. \",\"\")","v":""},null,null,null,null,null,null,null,null,null,null,null,null,null,null,null,null,null,null,null,null,null,null,null,{"$f":"IF($Z1+$AD1+$AB1<$D80+$D86,1,0)","v":0},{"$f":"IF($AA1+$AE1+$AC1<$E80+$E86,1,0)","v":0}]
[null,"36 a 47 meses",0]
[null,"48 a 59 meses",0,null,null,null,null,null,null,null,null,null,null,null,null,null,null,null,null,null,null,null,null,null,null,null,null,null,null,null,null,null,null,null,null,null,null,null,null,null,null,null,null,null,null,null,null,null,null,null,null,null,null,null,null,null,null,null,null,null,null,null,null,null,null,null,null,null,null,null,null,null,null,null,null,null,null,null,null,null,null,null,{"$f":"IF($R$11<$D$94+$D$100,\"* La suma de Población Masculina de 48 a 59 meses según resultado de 'Riesgo y Retraso' no puede ser mayor que la Población Masculina bajo control de la sección A. \",\"\")","v":""},{"$f":"IF($S$11<$E$94+$E$100,\"* La suma de Población Femenina de 48 a 59 meses según resultado de 'Riesgo y Retraso' no puede ser mayor que la Población Femenina bajo control de la sección A. \",\"\")","v":""},null,null,null,null,null,null,null,null,null,null,null,null,null,null,null,null,null,null,null,null,null,null,null,{"$f":"IF($R$11<$D$94+$D$100,1,0)","v":0},{"$f":"IF($S$11<$E$94+$E$100,1,0)","v":0}]
["NORMAL CON REZAGO","Menor de 12 meses",{"$f":"SUM(D83:E83)","v":0},null,null,null,null,null,null,null,null,null,null,null,null,null,null,null,null,null,null,null,null,null,null,null,null,null,null,null,null,null,null,null,null,null,null,null,null,null,null,null,null,null,null,null,null,null,null,null,null,null,null,null,null,null,null,null,null,null,null,null,null,null,null,null,null,null,null,null,null,null,null,null,null,null,null,null,null,null,null,null,{"$f":"IF($F6+$H6+$J6+$L6+$N6+$P6+$R6+$T6<$D83+$D89,\"* La suma de Población Masculina Menor de 12 meses según resultado de 'Riesgo y Retraso' no puede ser mayor que la Población Masculina bajo control de la sección A. \",\"\")","v":""},{"$f":"IF($G6+$I6+$K6+$M6+$O6+$Q6+$S6+$U6<$E83+$E89,\"* La suma de Población Femenina de Menor de 12 meses según resultado de 'Riesgo y Retraso' no puede ser mayor que la Población Femenina bajo control de la sección A. \",\"\")","v":""},null,null,null,null,null,null,null,null,null,null,null,null,null,null,null,null,null,null,null,null,null,null,null,{"$f":"IF($F6+$H6+$J6+$L6+$N6+$P6+$R6+$T6<$D83+$D89,1,0)","v":0},{"$f":"IF($G6+$I6+$K6+$M6+$O6+$Q6+$S6+$U6<$E83+$E89,1,0)","v":0}]
[null,"12 a 17 meses",0,null,null,null,null,null,null,null,null,null,null,null,null,null,null,null,null,null,null,null,null,null,null,null,null,null,null,null,null,null,null,null,null,null,null,null,null,null,null,null,null,null,null,null,null,null,null,null,null,null,null,null,null,null,null,null,null,null,null,null,null,null,null,null,null,null,null,null,null,null,null,null,null,null,null,null,null,null,null,null,{"$f":"IF($J$11<$D$90+$D$96,\"* La suma de Población Masculina de 12 a 17 meses según resultado de 'Riesgo y Retraso' no puede ser mayor que la Población Masculina bajo control de la sección A. \",\"\")","v":""},{"$f":"IF($K$11<$E$90+$E$96,\"* La suma de Población Femenina de 12 a 17 meses según resultado de 'Riesgo y Retraso' no puede ser mayor que la Población Femenina bajo control de la sección A. \",\"\")","v":""},null,null,null,null,null,null,null,null,null,null,null,null,null,null,null,null,null,null,null,null,null,null,null,{"$f":"IF($J$11<$D$90+$D$96,1,0)","v":0},{"$f":"IF($K$11<$E$90+$E$96,1,0)","v":0}]
[null,"18 a 23 meses",0,null,null,null,null,null,null,null,null,null,null,null,null,null,null,null,null,null,null,null,null,null,null,null,null,null,null,null,null,null,null,null,null,null,null,null,null,null,null,null,null,null,null,null,null,null,null,null,null,null,null,null,null,null,null,null,null,null,null,null,null,null,null,null,null,null,null,null,null,null,null,null,null,null,null,null,null,null,null,null,{"$f":"IF($L$11<$D$91+$D$97,\"* La suma de Población Masculina de 18 a 23 meses según resultado de 'Riesgo y Retraso' no puede ser mayor que la Población Masculina bajo control de la sección A. \",\"\")","v":""},{"$f":"IF($M$11<$E$91+$E$97,\"* La suma de Población Femenina de 18 a 23 meses según resultado de 'Riesgo y Retraso' no puede ser mayor que la Población Femenina bajo control de la sección A. \",\"\")","v":""},null,null,null,null,null,null,null,null,null,null,null,null,null,null,null,null,null,null,null,null,null,null,null,{"$f":"IF($L$11<$D$91+$D$97,1,0)","v":0},{"$f":"IF($M$11<$E$91+$E$97,1,0)","v":0}]
[null,"24 a 35 meses",0,null,null,null,null,null,null,null,null,null,null,null,null,null,null,null,null,null,null,null,null,null,null,null,null,null,null,null,null,null,null,null,null,null,null,null,null,null,null,null,null,null,null,null,null,null,null,null,null,null,null,null,null,null,null,null,null,null,null,null,null,null,null,null,null,null,null,null,null,null,null,null,null,null,null,null,null,null,null,null,{"$f":"IF($Z6+$AD6+$AB6<$D86+$D92,\"* La suma de Población Masculina de 24 a 47 meses según resultado de 'Riesgo y Retraso' no puede ser mayor que la Población Masculina bajo control de la sección A. \",\"\")","v":""},{"$f":"IF($AA6+$AE6+$AC6<$E86+$E92,\"* La suma de Población Femenina de 24 a 47 meses según resultado de 'Riesgo y Retraso' no puede ser mayor que la Población Femenina bajo control de la sección A. \",\"\")","v":""},null,null,null,null,null,null,null,null,null,null,null,null,null,null,null,null,null,null,null,null,null,null,null,{"$f":"IF($Z6+$AD6+$AB6<$D86+$D92,1,0)","v":0},{"$f":"IF($AA6+$AE6+$AC6<$E86+$E92,1,0)","v":0}]
[null,"36 a 47 meses",0]
[null,"48 a 59 meses",0,null,null,null,null,null,null,null,null,null,null,null,null,null,null,null,null,null,null,null,null,null,null,null,null,null,null,null,null,null,null,null,null,null,null,null,null,null,null,null,null,null,null,null,null,null,null,null,null,null,null,null,null,null,null,null,null,null,null,null,null,null,null,null,null,null,null,null,null,null,null,null,null,null,null,null,null,null,null,null,{"$f":"IF($R$11<$D$94+$D$100,\"* La suma de Población Masculina de 48 a 59 meses según resultado de 'Riesgo y Retraso' no puede ser mayor que la Población Masculina bajo control de la sección A. \",\"\")","v":""},{"$f":"IF($S$11<$E$94+$E$100,\"* La suma de Población Femenina de 48 a 59 meses según resultado de 'Riesgo y Retraso' no puede ser mayor que la Población Femenina bajo control de la sección A. \",\"\")","v":""},null,null,null,null,null,null,null,null,null,null,null,null,null,null,null,null,null,null,null,null,null,null,null,{"$f":"IF($R$11<$D$94+$D$100,1,0)","v":0},{"$f":"IF($S$11<$E$94+$E$100,1,0)","v":0}]
["RIESGO","Menor de 12 meses",0,null,null,null,null,null,null,null,null,null,null,null,null,null,null,null,null,null,null,null,null,null,null,null,null,null,null,null,null,null,null,null,null,null,null,null,null,null,null,null,null,null,null,null,null,null,null,null,null,null,null,null,null,null,null,null,null,null,null,null,null,null,null,null,null,null,null,null,null,null,null,null,null,null,null,null,null,null,null,null,{"$f":"IF(#REF!+#REF!+#REF!+#REF!+#REF!+#REF!+$F11+$H11<$D89+$D95,\"* La suma de Población Masculina Menor de 12 meses según resultado de 'Riesgo y Retraso' no puede ser mayor que la Población Masculina bajo control de la sección A. \",\"\")","v":{"$error":"#REF!"}},{"$f":"IF(#REF!+#REF!+#REF!+#REF!+#REF!+#REF!+$G11+$I11<$E89+$E95,\"* La suma de Población Femenina de Menor de 12 meses según resultado de 'Riesgo y Retraso' no puede ser mayor que la Población Femenina bajo control de la sección A. \",\"\")","v":{"$error":"#REF!"}},null,null,null,null,null,null,null,null,null,null,null,null,null,null,null,null,null,null,null,null,null,null,null,{"$f":"IF(#REF!+#REF!+#REF!+#REF!+#REF!+#REF!+$F11+$H11<$D89+$D95,1,0)","v":{"$error":"#REF!"}},{"$f":"IF(#REF!+#REF!+#REF!+#REF!+#REF!+#REF!+$G11+$I11<$E89+$E95,1,0)","v":{"$error":"#REF!"}}]
[null,"12 a 17 meses",0,null,null,null,null,null,null,null,null,null,null,null,null,null,null,null,null,null,null,null,null,null,null,null,null,null,null,null,null,null,null,null,null,null,null,null,null,null,null,null,null,null,null,null,null,null,null,null,null,null,null,null,null,null,null,null,null,null,null,null,null,null,null,null,null,null,null,null,null,null,null,null,null,null,null,null,null,null,null,null,{"$f":"IF($J$11<$D$90+$D$96,\"* La suma de Población Masculina de 12 a 17 meses según resultado de 'Riesgo y Retraso' no puede ser mayor que la Población Masculina bajo control de la sección A. \",\"\")","v":""},{"$f":"IF($K$11<$E$90+$E$96,\"* La suma de Población Femenina de 12 a 17 meses según resultado de 'Riesgo y Retraso' no puede ser mayor que la Población Femenina bajo control de la sección A. \",\"\")","v":""},null,null,null,null,null,null,null,null,null,null,null,null,null,null,null,null,null,null,null,null,null,null,null,{"$f":"IF($J$11<$D$90+$D$96,1,0)","v":0},{"$f":"IF($K$11<$E$90+$E$96,1,0)","v":0}]
[null,"18 a 23 meses",0,null,null,null,null,null,null,null,null,null,null,null,null,null,null,null,null,null,null,null,null,null,null,null,null,null,null,null,null,null,null,null,null,null,null,null,null,null,null,null,null,null,null,null,null,null,null,null,null,null,null,null,null,null,null,null,null,null,null,null,null,null,null,null,null,null,null,null,null,null,null,null,null,null,null,null,null,null,null,null,{"$f":"IF($L$11<$D$91+$D$97,\"* La suma de Población Masculina de 18 a 23 meses según resultado de 'Riesgo y Retraso' no puede ser mayor que la Población Masculina bajo control de la sección A. \",\"\")","v":""},{"$f":"IF($M$11<$E$91+$E$97,\"* La suma de Población Femenina de 18 a 23 meses según resultado de 'Riesgo y Retraso' no puede ser mayor que la Población Femenina bajo control de la sección A. \",\"\")","v":""},null,null,null,null,null,null,null,null,null,null,null,null,null,null,null,null,null,null,null,null,null,null,null,{"$f":"IF($L$11<$D$91+$D$97,1,0)","v":0},{"$f":"IF($M$11<$E$91+$E$97,1,0)","v":0}]
[null,"24 a 35 meses",0,null,null,null,null,null,null,null,null,null,null,null,null,null,null,null,null,null,null,null,null,null,null,null,null,null,null,null,null,null,null,null,null,null,null,null,null,null,null,null,null,null,null,null,null,null,null,null,null,null,null,null,null,null,null,null,null,null,null,null,null,null,null,null,null,null,null,null,null,null,null,null,null,null,null,null,null,null,null,null,{"$f":"IF($N11+$P11+#REF!<$D92+$D98,\"* La suma de Población Masculina de 24 a 47 meses según resultado de 'Riesgo y Retraso' no puede ser mayor que la Población Masculina bajo control de la sección A. \",\"\")","v":{"$error":"#REF!"}},{"$f":"IF($O11+$Q11+#REF!<$E92+$E98,\"* La suma de Población Femenina de 24 a 47 meses según resultado de 'Riesgo y Retraso' no puede ser mayor que la Población Femenina bajo control de la sección A. \",\"\")","v":{"$error":"#REF!"}},null,null,null,null,null,null,null,null,null,null,null,null,null,null,null,null,null,null,null,null,null,null,null,{"$f":"IF($N11+$P11+#REF!<$D92+$D98,1,0)","v":{"$error":"#REF!"}},{"$f":"IF($O11+$Q11+#REF!<$E92+$E98,1,0)","v":{"$error":"#REF!"}}]
[null,"36 a 47 meses",0]
[null,"48 a 59 meses",0,null,null,null,null,null,null,null,null,null,null,null,null,null,null,null,null,null,null,null,null,null,null,null,null,null,null,null,null,null,null,null,null,null,null,null,null,null,null,null,null,null,null,null,null,null,null,null,null,null,null,null,null,null,null,null,null,null,null,null,null,null,null,null,null,null,null,null,null,null,null,null,null,null,null,null,null,null,null,null,{"$f":"IF($R$11<$D$94+$D$100,\"* La suma de Población Masculina de 48 a 59 meses según resultado de 'Riesgo y Retraso' no puede ser mayor que la Población Masculina bajo control de la sección A. \",\"\")","v":""},{"$f":"IF($S$11<$E$94+$E$100,\"* La suma de Población Femenina de 48 a 59 meses según resultado de 'Riesgo y Retraso' no puede ser mayor que la Población Femenina bajo control de la sección A. \",\"\")","v":""},null,null,null,null,null,null,null,null,null,null,null,null,null,null,null,null,null,null,null,null,null,null,null,{"$f":"IF($R$11<$D$94+$D$100,1,0)","v":0},{"$f":"IF($S$11<$E$94+$E$100,1,0)","v":0}]
["RETRASO","Menor de 12 meses",0]
[null,"12 a 17 meses",0]
[null,"18 a 23 meses",0]
[null,"24 a 35 meses",0]
[null,"36 a 47 meses",0]
[null,"48 a 59 meses",{"$f":"SUM(D100:E100)","v":0}]
["SECCION C: POBLACIÓN MENOR DE 1 AÑO EN CONTROL, SEGÚN SCORE RIESGO EN IRA Y VISITA DOMICILIARIA INTEGRAL "]
["RESULTADO",null,"TOTAL","Diada, menor de 10 días","1 mes","2 meses","3 meses","4 meses","5 meses","6 meses","7 a 12 meses","Total de Niños y Niñas que han recibido VDI","Pueblos Originarios","Migrantes"]
[]
["SCORE \nDE RIESGO","LEVE",{"$f":"SUM(D104:K104)","v":0}]
[null,"MODERADO",{"$f":"SUM(D105:K105)","v":0},null,null,null,null,null,null,null,null,null,null,null,null,null,null,null,null,null,null,null,null,null,null,null,null,null,null,null,null,null,null,null,null,null,null,null,null,null,null,null,null,null,null,null,null,null,null,null,null,null,null,null,null,null,null,null,null,null,null,null,null,null,null,null,null,null,null,null,null,null,null,null,null,null,null,null,null,null,null,null,null,null,{"$f":"IF($C105<$L105, \"* Niños visitados no puede ser mayor que el total Score Moderado. \",\"\")","v":""},null,null,null,null,null,null,null,null,null,null,null,null,null,null,null,null,null,null,null,null,null,null,null,{"$f":"IF($C105<$L105, 1,0)","v":0}]
[null,"GRAVE",{"$f":"SUM(D106:K106)","v":0},null,null,null,null,null,null,null,null,null,null,null,null,null,null,null,null,null,null,null,null,null,null,null,null,null,null,null,null,null,null,null,null,null,null,null,null,null,null,null,null,null,null,null,null,null,null,null,null,null,null,null,null,null,null,null,null,null,null,null,null,null,null,null,null,null,null,null,null,null,null,null,null,null,null,null,null,null,null,null,null,null,{"$f":"IF($C106<$L106, \"* Niños visitados no puede ser mayor que el total Score Grave. \",\"\")","v":""},null,null,null,null,null,null,null,null,null,null,null,null,null,null,null,null,null,null,null,null,null,null,null,{"$f":"IF($C106<$L106,1,0)","v":0}]
[null,"TOTAL",{"$f":"SUM(D107:K107)","v":0},{"$f":"SUM(D104:D106)","v":0},0,0,0,0,0,{"$f":"SUM(J104:J106)","v":0},0,{"$f":"SUM(L105:L106)","v":0},{"$f":"SUM(M105:M106)","v":0},{"$f":"SUM(N105:N106)","v":0}]
["SECCION D: POBLACIÓN EN CONTROL EN EL SEMESTRE CON CONSULTA NUTRICIONAL, SEGÚN ESTRATEGIA"]
["NIÑO/A CON CONSULTA NUTRICIONAL EN",null,"TOTAL"]
[]
["Del 5to mes"]
["De los 3 años y 6 meses"]
["SECCION E: POBLACIÓN INASISTENTE A CONTROL DEL NIÑO SANO (AL CORTE)"]
["EDAD",null,"TOTAL"]
[]
["0 de 6 meses"]
["De 7 a 11 meses"]
["12 - 17 meses"]
["18 - 23 meses"]
["24 - 35 meses"]
["36 - 47 meses"]
["48 - 59 meses"]
["60 - 71 meses"]
["De 6 a 9 años"]
["TOTAL",null,{"$f":"SUM(C116:C124)","v":0}]
["SECCION F: POBLACIÓN INFANTIL SEGÚN DIAGNÓSTICO DE PRESIÓN ARTERIAL (Incluida en sección A y A1)"]
["CLASIFICACIÓN",null,"Total",null,null,"GRUPOS DE EDAD (en meses)",null,null,null,null,null,"Derivación Nivel Secundario"]
[null,null,null,null,null,"36 a 47 meses",null,"48 a 71 meses",null,"6-9 años"]
[null,null,"Total","Hombres","Mujeres","Hombres","Mujeres","Hombres","Mujeres","Hombres","Mujeres"]
["NORMAL (PA menor al percentil 90)",null,{"$f":"SUM(D130:E130)","v":0},{"$f":"+F130+H130+J130","v":0},{"$f":"+G130+I130+K130","v":0},null,null,null,null,null,null,null,null,null,null,null,null,null,null,null,null,null,null,null,null,null,null,null,null,null,null,null,null,null,null,null,null,null,null,null,null,null,null,null,null,null,null,null,null,null,null,null,null,null,null,null,null,null,null,null,null,null,null,null,null,null,null,null,null,null,null,null,null,null,null,null,null,null,null,null,null,null,null,null,null,null,null,null,null,null,null,{"$f":"IF($F130<=SUM($P$11:$Q$11),\"\",\"* Niños(as) de 36 a 47 ms clasificados debe ser menor o igual al Total de la población de niños bajo control de en sección A misma edad. \")","v":""},{"$f":"IF($I130<=SUM($R$11:$S$11,$F$44:$G$44),\"\",\"* Niños(as) de 48 a 71 meses clasificados debe ser menor o igual al Total de la población de niños bajo control de en sección A y A1 de la misma edad. \")","v":""},{"$f":"IF($K130<=SUM($N$44:$O$44),\"\",\"* Niños(as) de 6 a 9 años clasificados debe ser menor o igual al Total de la población de niños bajo control de en sección A1 misma edad \")","v":""},null,null,null,null,null,null,null,null,null,null,null,null,null,null,null,null,null,null,null,{"$f":"IF($F130<=SUM($P$11:$Q$11),0,1)","v":0},{"$f":"IF($I130<=SUM($R$11:$S$11,$F$44:$G$44),0,1)","v":0},{"$f":"IF($K130<=SUM($N$44:$O$44),0,1)","v":0}]
["PRESIÓN ARTERIAL ELEVADA",null,{"$f":"SUM(D131:E131)","v":0},{"$f":"+F131+H131+J131","v":0},{"$f":"+G131+I131+K131","v":0},null,null,null,null,null,null,null,null,null,null,null,null,null,null,null,null,null,null,null,null,null,null,null,null,null,null,null,null,null,null,null,null,null,null,null,null,null,null,null,null,null,null,null,null,null,null,null,null,null,null,null,null,null,null,null,null,null,null,null,null,null,null,null,null,null,null,null,null,null,null,null,null,null,null,null,null,null,null,null,null,null,null,null,null,null,null,{"$f":"IF($F131<=SUM($P$11:$Q$11),\"\",\"* Niños(as) de 36 a 47 ms clasificados debe ser menor o igual al Total de la población de niños bajo control de en sección A misma edad. \")","v":""},{"$f":"IF($I131<=SUM($R$11:$S$11,$F$44:$G$44),\"\",\"* Niños(as) de 48 a 71 meses clasificados debe ser menor o igual al Total de la población de niños bajo control de en sección A y A1 de la misma edad. \")","v":""},{"$f":"IF($K131<=SUM($N$44:$O$44),\"\",\"* Niños(as) de 6 a 9 años clasificados debe ser menor o igual al Total de la población de niños bajo control de en sección A1 misma edad \")","v":""},null,null,null,null,null,null,null,null,null,null,null,null,null,null,null,null,null,null,null,{"$f":"IF($F131<=SUM($P$11:$Q$11),0,1)","v":0},{"$f":"IF($I131<=SUM($R$11:$S$11,$F$44:$G$44),0,1)","v":0},{"$f":"IF($K131<=SUM($N$44:$O$44),0,1)","v":0}]
["HTA ESTADIO I ",null,0,{"$f":"+F132+H132+J132","v":0},0,null,null,null,null,null,null,null,null,null,null,null,null,null,null,null,null,null,null,null,null,null,null,null,null,null,null,null,null,null,null,null,null,null,null,null,null,null,null,null,null,null,null,null,null,null,null,null,null,null,null,null,null,null,null,null,null,null,null,null,null,null,null,null,null,null,null,null,null,null,null,null,null,null,null,null,null,null,null,null,null,null,null,null,null,null,null,{"$f":"IF($F132<=SUM($P$11:$Q$11),\"\",\"* Niños(as) de 36 a 47 ms clasificados debe ser menor o igual al Total de la población de niños bajo control de en sección A misma edad. \")","v":""},{"$f":"IF($I132<=SUM($R$11:$S$11,$F$44:$G$44),\"\",\"* Niños(as) de 48 a 71 meses clasificados debe ser menor o igual al Total de la población de niños bajo control de en sección A y A1 de la misma edad. \")","v":""},{"$f":"IF($K132<=SUM($N$44:$O$44),\"\",\"* Niños(as) de 6 a 9 años clasificados debe ser menor o igual al Total de la población de niños bajo control de en sección A1 misma edad \")","v":""},null,null,null,null,null,null,null,null,null,null,null,null,null,null,null,null,null,null,null,{"$f":"IF($F132<=SUM($P$11:$Q$11),0,1)","v":0},{"$f":"IF($I132<=SUM($R$11:$S$11,$F$44:$G$44),0,1)","v":0},{"$f":"IF($K132<=SUM($N$44:$O$44),0,1)","v":0}]
["HTA ESTADIO II",null,0,0,0,null,null,null,null,null,null,null,null,null,null,null,null,null,null,null,null,null,null,null,null,null,null,null,null,null,null,null,null,null,null,null,null,null,null,null,null,null,null,null,null,null,null,null,null,null,null,null,null,null,null,null,null,null,null,null,null,null,null,null,null,null,null,null,null,null,null,null,null,null,null,null,null,null,null,null,null,null,null,null,null,null,null,null,null,null,null,{"$f":"IF($F133<=SUM($P$11:$Q$11),\"\",\"* Niños(as) de 36 a 47 ms clasificados debe ser menor o igual al Total de la población de niños bajo control de en sección A misma edad. \")","v":""},{"$f":"IF($I133<=SUM($R$11:$S$11,$F$44:$G$44),\"\",\"* Niños(as) de 48 a 71 meses clasificados debe ser menor o igual al Total de la población de niños bajo control de en sección A y A1 de la misma edad. \")","v":""},{"$f":"IF($K133<=SUM($N$44:$O$44),\"\",\"* Niños(as) de 6 a 9 años clasificados debe ser menor o igual al Total de la población de niños bajo control de en sección A1 misma edad \")","v":""},null,null,null,null,null,null,null,null,null,null,null,null,null,null,null,null,null,null,null,{"$f":"IF($F133<=SUM($P$11:$Q$11),0,1)","v":0},{"$f":"IF($I133<=SUM($R$11:$S$11,$F$44:$G$44),0,1)","v":0},{"$f":"IF($K133<=SUM($N$44:$O$44),0,1)","v":0}]
[" ",null,{"$f":"SUM(D134:E134)","v":0},{"$f":"+F134+H134+J134","v":0},{"$f":"+G134+I134+K134","v":0},{"$f":"SUM(F130:F133)","v":0},{"$f":"SUM(G130:G133)","v":0},{"$f":"SUM(H130:H133)","v":0},0,0,{"$f":"SUM(K130:K133)","v":0},{"$f":"SUM(L130:L133)","v":0},null,null,null,null,null,null,null,null,null,null,null,null,null,null,null,null,null,null,null,null,null,null,null,null,null,null,null,null,null,null,null,null,null,null,null,null,null,null,null,null,null,null,null,null,null,null,null,null,null,null,null,null,null,null,null,null,null,null,null,null,null,null,null,null,null,null,null,null,null,null,null,null,null,null,null,null,null,null,null,{"$f":"IF($F134<=SUM(P11:Q11),\"\",\"* Niños(as) de 36 a 47 ms clasificados debe ser menor o igual al Total de la población de niños bajo control de en sección A misma edad. \")","v":""},{"$f":"IF($I134<=SUM($R$11:$S$11,$F$44:$G$44),\"\",\"* Niños(as) de 48 a 71 meses clasificados debe ser menor o igual al Total de la población de niños bajo control de en sección A y A1 de la misma edad. \")","v":""},{"$f":"IF($K134<=SUM($N$44:$O$44),\"\",\"* Niños(as) de 6 a 9 años clasificados debe ser menor o igual al Total de la población de niños bajo control de en sección A1 misma edad \")","v":""},null,null,null,null,null,null,null,null,null,null,null,null,null,null,null,null,null,null,null,{"$f":"IF($F134<=SUM($P$11:$Q$11),0,1)","v":0},{"$f":"IF($I134<=SUM($R$11:$S$11,$F$44:$G$44),0,1)","v":0},{"$f":"IF($K134<=SUM($N$44:$O$44),0,1)","v":0}]
["SECCION G: POBLACIÓN INFANTIL EUTRÓFICA, SEGÚN RIESGO DE MALNUTRICIÓN POR EXCESO (Incluida en sección A y A1)"]
["RESULTADO",null,"TOTAL","GRUPOS DE EDAD (en meses)"]
[null,null,null,"4 a 11 meses","12 a 23 meses","24 a 35 meses","36 a 47 meses","48 a 59 meses","60 a 71 meses"]
["SIN RIESGO",null,{"$f":"SUM(D138:I138)","v":0},null,null,null,null,null,null,{"$f":" CF138 & CG138 & CH138 & CI138 & CJ138 & CK138","v":""},null,null,null,null,null,null,null,null,null,null,null,null,null,null,null,null,null,null,null,null,null,null,null,null,null,null,null,null,null,null,null,null,null,null,null,null,null,null,null,null,null,null,null,null,null,null,null,null,null,null,null,null,null,null,null,null,null,null,null,null,null,null,null,null,null,null,null,null,null,null,null,null,null,{"$f":"IF($D138<=SUM($F$35:$I$35),\"\",\"* Niños(as) de 4 a 11 ms clasificados debe ser menor o igual al Total niños diagnostidos en NORMAL sección A misma edad. \")","v":""},{"$f":"IF($E138<=SUM($J$35:$M$35),\"\",\"* Niños(as) de 12 a 23 ms clasificados debe ser menor o igual al Total niños diagnosticados en NORMAL en sección A misma edad. \")","v":""},{"$f":"IF($F138<=SUM($N$35:$O$35),\"\",\"* Niños(as) de 24 a 35 ms clasificados debe ser menor o igual al Total niños diagnosticados en NORMAL en sección A misma edad. \")","v":""},{"$f":"IF($G138<=SUM($P$35:$Q$35),\"\",\"* Niños(as) de 36 a 47 ms clasificados debe ser menor o igual al Total niños diagnosticos en NORMAL en sección A misma edad. \")","v":""},{"$f":"IF($H138<=SUM($R$35:$S$35),\"\",\"* Niños(as) de 48 a 59 ms clasificados debe ser menor o igual al Total niños diagnosticados en NORMAL en sección A misma edad. \")","v":""},{"$f":"IF($I138<=SUM($F$69:$G$69),\"\",\"* Niños(as) de 60 a 71 ms clasificados debe ser menor o igual al Total niños diagnosticados en NORMAL en sección A1 misma edad. \")","v":""},null,null,null,null,null,null,null,null,null,null,null,null,null,null,null,null,null,null,null,{"$f":"IF($D138<=SUM($F$35:$I$35),0,1)","v":0},{"$f":"IF($E138<=SUM($J$35:$M$35),0,1)","v":0},{"$f":"IF($F138<=SUM($N$35:$O$35),0,1)","v":0},{"$f":"IF($G138<=SUM($P$35:$Q$35),0,1)","v":0},{"$f":"IF($H138<=SUM($R$35:$S$35),0,1)","v":0},{"$f":"IF($I138<=SUM($F$69:$G$69),0,1)","v":0}]
["CON RIESGO",null,{"$f":"SUM(D139:I139)","v":0},null,null,null,null,null,null,{"$f":" CF139 & CG139 & CH139 & CI139 & CJ139 & CK139","v":""},null,null,null,null,null,null,null,null,null,null,null,null,null,null,null,null,null,null,null,null,null,null,null,null,null,null,null,null,null,null,null,null,null,null,null,null,null,null,null,null,null,null,null,null,null,null,null,null,null,null,null,null,null,null,null,null,null,null,null,null,null,null,null,null,null,null,null,null,null,null,null,null,null,{"$f":"IF($D139<=SUM($F$35:$I$35),\"\",\"* Niños(as) de 4 a 11 ms clasificados debe ser menor o igual al Total niños diagnostidos en NORMAL sección A misma edad. \")","v":""},{"$f":"IF($E139<=SUM($J$35:$M$35),\"\",\"* Niños(as) de 12 a 23 ms clasificados debe ser menor o igual al Total niños diagnosticados en NORMAL en sección A misma edad. \")","v":""},{"$f":"IF($F139<=SUM($N$35:$O$35),\"\",\"* Niños(as) de 24 a 35 ms clasificados debe ser menor o igual al Total niños diagnosticados en NORMAL en sección A misma edad. \")","v":""},{"$f":"IF($G139<=SUM($P$35:$Q$35),\"\",\"* Niños(as) de 36 a 47 ms clasificados debe ser menor o igual al Total niños diagnosticos en NORMAL en sección A misma edad. \")","v":""},{"$f":"IF($H139<=SUM($R$35:$S$35),\"\",\"* Niños(as) de 48 a 59 ms clasificados debe ser menor o igual al Total niños diagnosticados en NORMAL en sección A misma edad. \")","v":""},{"$f":"IF($I139<=SUM($F$69:$G$69),\"\",\"* Niños(as) de 60 a 71 ms clasificados debe ser menor o igual al Total niños diagnosticados en NORMAL en sección A1 misma edad. \")","v":""},null,null,null,null,null,null,null,null,null,null,null,null,null,null,null,null,null,null,null,{"$f":"IF($D139<=SUM($F$35:$I$35),0,1)","v":0},{"$f":"IF($E139<=SUM($J$35:$M$35),0,1)","v":0},{"$f":"IF($F139<=SUM($N$35:$O$35),0,1)","v":0},{"$f":"IF($G139<=SUM($P$35:$Q$35),0,1)","v":0},{"$f":"IF($H139<=SUM($R$35:$S$35),0,1)","v":0},{"$f":"IF($I139<=SUM($F$69:$G$69),0,1)","v":0}]
["TOTAL",null,{"$f":"SUM(D140:I140)","v":0},{"$f":"SUM(D138:D139)","v":0},0,0,0,0,0,{"$f":" CF140 & CG140 & CH140 & CI140 & CJ140 & CK140","v":""},null,null,null,null,null,null,null,null,null,null,null,null,null,null,null,null,null,null,null,null,null,null,null,null,null,null,null,null,null,null,null,null,null,null,null,null,null,null,null,null,null,null,null,null,null,null,null,null,null,null,null,null,null,null,null,null,null,null,null,null,null,null,null,null,null,null,null,null,null,null,null,null,null,{"$f":"IF($D140<=SUM($F$35:$I$35),\"\",\"* Niños(as) de 4 a 11 ms clasificados debe ser menor o igual al Total niños diagnostidos en NORMAL sección A misma edad. \")","v":""},{"$f":"IF($E140<=SUM($J$35:$M$35),\"\",\"* Niños(as) de 12 a 23 ms clasificados debe ser menor o igual al Total niños diagnosticados en NORMAL en sección A misma edad. \")","v":""},{"$f":"IF($F140<=SUM($N$35:$O$35),\"\",\"* Niños(as) de 24 a 35 ms clasificados debe ser menor o igual al Total niños diagnosticados en NORMAL en sección A misma edad. \")","v":""},{"$f":"IF($G140<=SUM($P$35:$Q$35),\"\",\"* Niños(as) de 36 a 47 ms clasificados debe ser menor o igual al Total niños diagnosticos en NORMAL en sección A misma edad. \")","v":""},{"$f":"IF($H140<=SUM($R$35:$S$35),\"\",\"* Niños(as) de 48 a 59 ms clasificados debe ser menor o igual al Total niños diagnosticados en NORMAL en sección A misma edad. \")","v":""},{"$f":"IF($I140<=SUM($F$69:$G$69),\"\",\"* Niños(as) de 60 a 71 ms clasificados debe ser menor o igual al Total niños diagnosticados en NORMAL en sección A1 misma edad. \")","v":""},null,null,null,null,null,null,null,null,null,null,null,null,null,null,null,null,null,null,null,{"$f":"IF($D140<=SUM($F$35:$I$35),0,1)","v":0},{"$f":"IF($E140<=SUM($J$35:$M$35),0,1)","v":0},{"$f":"IF($F140<=SUM($N$35:$O$35),0,1)","v":0},{"$f":"IF($G140<=SUM($P$35:$Q$35),0,1)","v":0},{"$f":"IF($H140<=SUM($R$35:$S$35),0,1)","v":0},{"$f":"IF($I140<=SUM($F$69:$G$69),0,1)","v":0}]
["SECCION H: POBLACIÓN SEGÚN DIAGNÓSTICO DE NIÑOS, NIÑAS Y ADOLESCENTES CON NECESIDADES ESPECIALES DE ATENCIÓN EN SALUD (NANEAS) (Incluida en sección A y A1)"]
["DISGNOSTICOS",null,"TOTAL",null,null,"GRUPOS DE EDAD (en meses - años) Y SEXO",null,null,null,null,null,null,null,null,null,null,null,null,null,null,null,null,null,null,null,null,null,null,null,null,null,null,null,null,null,null,null,null,null,null,null,null,null,"Pueblos Originarios",null,"Población Migrantes"]
[null,null,null,null,null,"Menor de 1 mes",null,"1 mes",null,"2 meses",null,"3 meses",null,"4 meses",null,"5 meses",null,"6 meses",null,"7 a 11 meses",null,"12 a 17 meses",null,"18 a 23 meses",null,"24 a 35 meses",null,"36 a 41 meses",null,"42 a 47 meses",null,"48 a 59 meses",null,"60 a 71 meses",null,"6 a 7 años",null,"8 a 9 años",null,"10 a 14 años",null,"15 a 19 años"]
[null,null,"Ambos sexos","Hombres","Mujeres","Hombres","Mujeres","Hombres","Mujeres","Hombres","Mujeres","Hombres","Mujeres","Hombres","Mujeres","Hombres","Mujeres","Hombres","Mujeres","Hombres","Mujeres","Hombres","Mujeres","Hombres","Mujeres","Hombres","Mujeres","Hombres","Mujeres","Hombres","Mujeres","Hombres","Mujeres","Hombres","Mujeres","Hombres","Mujeres","Hombres","Mujeres","Hombres","Mujeres","Hombres","Mujeres","Hombres","Mujeres","Hombres","Mujeres"]
["TOTAL POBLACIÓN NANES BAJO CONTROL",null,{"$f":"SUM(D145:E145)","v":0},{"$f":"+F145+H145+J145+L145+N145+P145+R145+T145+V145+X145+Z145+AB145+AD145+AF145+AH145+AN145+AP145+AJ145+AL145","v":0},{"$f":"+G145+I145+K145+M145+O145+Q145+S145+U145+W145+Y145+AA145+AC145+AE145+AG145+AI145+AO145+AQ145+AK145+AM145","v":0},null,null,null,null,null,null,null,null,null,null,null,null,null,null,null,null,null,null,null,null,null,null,null,null,null,null,null,null,null,null,null,null,null,null,null,null,null,null,null,null,null,null,{"$f":"CF145&CG145&CH145&CI145","v":""}]
["Síndrome de Down ",null,{"$f":"SUM(D146:E146)","v":0},{"$f":"+F146+H146+J146+L146+N146+P146+R146+T146+V146+X146+Z146+AB146+AD146+AF146+AH146+AN146+AP146+AJ146+AL146","v":0},{"$f":"+G146+I146+K146+M146+O146+Q146+S146+U146+W146+Y146+AA146+AC146+AE146+AG146+AI146+AO146+AQ146+AK146+AM146","v":0},null,null,null,null,null,null,null,null,null,null,null,null,null,null,null,null,null,null,null,null,null,null,null,null,null,null,null,null,null,null,null,null,null,null,null,null,null,null,null,null,null,null,{"$f":"CF146&CG146&CH146&CI146","v":""},null,null,null,null,null,null,null,null,null,null,null,null,null,null,null,null,null,null,null,null,null,null,null,null,null,null,null,null,null,null,null,null,null,null,null,{"$f":"IF(DE146=1,\"* No olvide escribir en las celdas de \"\"Pueblos Originarios\"\" (Digite Cero si no tiene).\",\"\")","v":""},{"$f":"IF(DF146=1,\"* No olvide escribir en las celdas de \"\"Población Migrante\"\" (Digite Cero si no tiene).\",\"\")","v":""},{"$f":"IF(DG146=1,\"* La suma de las celdas de \"\"Pueblos Originarios\"\"no debe superar el Total.\",\"\")","v":""},{"$f":"IF(DH146=1,\"* La suma de las celdas de \"\"Población Migrante\"\" no debe superar el Total.\",\"\")","v":""},null,null,null,null,null,null,null,null,null,null,null,null,null,null,null,null,null,null,null,null,null,{"$f":"IF(AND($C146<>0,OR(AR146=\"\",AS146=\"\")),1,0)","v":0},{"$f":"IF(AND($C146<>0,OR(AT146=\"\",AU146=\"\")),1,0)","v":0},{"$f":"IF((AR146+AS146)>$C146,1,0)","v":0},{"$f":"IF((AU146+AT146)>$C146,1,0)","v":0}]
["Prematuros","Prematuros",{"$f":"SUM(D147:E147)","v":0},{"$f":"+F147+H147+J147+L147+N147+P147+R147+T147+V147+X147+Z147+AB147+AD147+AF147+AH147+AN147+AP147+AJ147+AL147","v":0},{"$f":"+G147+I147+K147+M147+O147+Q147+S147+U147+W147+Y147+AA147+AC147+AE147+AG147+AI147+AO147+AQ147+AK147+AM147","v":0},null,null,null,null,null,null,null,null,null,null,null,null,null,null,null,null,null,null,null,null,null,null,null,null,null,null,null,null,null,null,null,null,null,null,null,null,null,null,null,null,null,null,{"$f":"CF147&CG147&CH147&CI147","v":""},null,null,null,null,null,null,null,null,null,null,null,null,null,null,null,null,null,null,null,null,null,null,null,null,null,null,null,null,null,null,null,null,null,null,null,{"$f":"IF(DE147=1,\"* No olvide escribir en las celdas de \"\"Pueblos Originarios\"\" (Digite Cero si no tiene).\",\"\")","v":""},{"$f":"IF(DF147=1,\"* No olvide escribir en las celdas de \"\"Población Migrante\"\" (Digite Cero si no tiene).\",\"\")","v":""},{"$f":"IF(DG147=1,\"* La suma de las celdas de \"\"Pueblos Originarios\"\"no debe superar el Total.\",\"\")","v":""},{"$f":"IF(DH147=1,\"* La suma de las celdas de \"\"Población Migrante\"\" no debe superar el Total.\",\"\")","v":""},null,null,null,null,null,null,null,null,null,null,null,null,null,null,null,null,null,null,null,null,null,{"$f":"IF(AND($C147<>0,OR(AR147=\"\",AS147=\"\")),1,0)","v":0},{"$f":"IF(AND($C147<>0,OR(AT147=\"\",AU147=\"\")),1,0)","v":0},{"$f":"IF((AR147+AS147)>$C147,1,0)","v":0},{"$f":"IF((AU147+AT147)>$C147,1,0)","v":0}]
["Hipotiroidismo ","Hipotiroidismo ",0,0,0,null,null,null,null,null,null,null,null,null,null,null,null,null,null,null,null,null,null,null,null,null,null,null,null,null,null,null,null,null,null,null,null,null,null,null,null,null,null,null,null,null,null,{"$f":"CF148&CG148&CH148&CI148","v":""}]
["Diabetes tipo I ","Diabetes tipo I ",0,0,0,null,null,null,null,null,null,null,null,null,null,null,null,null,null,null,null,null,null,null,null,null,null,null,null,null,null,null,null,null,null,null,null,null,null,null,null,null,null,null,null,null,null,"",null,null,null,null,null,null,null,null,null,null,null,null,null,null,null,null,null,null,null,null,null,null,null,null,null,null,null,null,null,null,null,null,null,null,null,{"$f":"IF(DE149=1,\"* No olvide escribir en las celdas de \"\"Pueblos Originarios\"\" (Digite Cero si no tiene).\",\"\")","v":""},{"$f":"IF(DF149=1,\"* No olvide escribir en las celdas de \"\"Población Migrante\"\" (Digite Cero si no tiene).\",\"\")","v":""},{"$f":"IF(DG149=1,\"* La suma de las celdas de \"\"Pueblos Originarios\"\"no debe superar el Total.\",\"\")","v":""},{"$f":"IF(DH149=1,\"* La suma de las celdas de \"\"Población Migrante\"\" no debe superar el Total.\",\"\")","v":""},null,null,null,null,null,null,null,null,null,null,null,null,null,null,null,null,null,null,null,null,null,{"$f":"IF(AND($C149<>0,OR(AR149=\"\",AS149=\"\")),1,0)","v":0},{"$f":"IF(AND($C149<>0,OR(AT149=\"\",AU149=\"\")),1,0)","v":0},{"$f":"IF((AR149+AS149)>$C149,1,0)","v":0},{"$f":"IF((AU149+AT149)>$C149,1,0)","v":0}]
["Diabetes tipo II ","Diabetes tipo II ",0,0,0,null,null,null,null,null,null,null,null,null,null,null,null,null,null,null,null,null,null,null,null,null,null,null,null,null,null,null,null,null,null,null,null,null,null,null,null,null,null,null,null,null,null,""]
["Otras Enfermedades endocrinológicas (no incluye Hipotiroidismo, ni Diabetes) ","Otras Enfermedades endocrinológicas (no incluye Hipotiroidismo, ni Diabetes) ",0,0,0,null,null,null,null,null,null,null,null,null,null,null,null,null,null,null,null,null,null,null,null,null,null,null,null,null,null,null,null,null,null,null,null,null,null,null,null,null,null,null,null,null,null,""]
["Errores Innatos del Metabolismo","Errores Innatos del Metabolismo",0,0,0,null,null,null,null,null,null,null,null,null,null,null,null,null,null,null,null,null,null,null,null,null,null,null,null,null,null,null,null,null,null,null,null,null,null,null,null,null,null,null,null,null,null,"",null,null,null,null,null,null,null,null,null,null,null,null,null,null,null,null,null,null,null,null,null,null,null,null,null,null,null,null,null,null,null,null,null,null,null,{"$f":"IF(DE152=1,\"* No olvide escribir en las celdas de \"\"Pueblos Originarios\"\" (Digite Cero si no tiene).\",\"\")","v":""},{"$f":"IF(DF152=1,\"* No olvide escribir en las celdas de \"\"Población Migrante\"\" (Digite Cero si no tiene).\",\"\")","v":""},{"$f":"IF(DG152=1,\"* La suma de las celdas de \"\"Pueblos Originarios\"\"no debe superar el Total.\",\"\")","v":""},{"$f":"IF(DH152=1,\"* La suma de las celdas de \"\"Población Migrante\"\" no debe superar el Total.\",\"\")","v":""},null,null,null,null,null,null,null,null,null,null,null,null,null,null,null,null,null,null,null,null,null,{"$f":"IF(AND($C152<>0,OR(AR152=\"\",AS152=\"\")),1,0)","v":0},{"$f":"IF(AND($C152<>0,OR(AT152=\"\",AU152=\"\")),1,0)","v":0},{"$f":"IF((AR152+AS152)>$C152,1,0)","v":0},{"$f":"IF((AU152+AT152)>$C152,1,0)","v":0}]
["Otros Trastornos del metabolismo ","Otros Trastornos del metabolismo ",0,0,0,null,null,null,null,null,null,null,null,null,null,null,null,null,null,null,null,null,null,null,null,null,null,null,null,null,null,null,null,null,null,null,null,null,null,null,null,null,null,null,null,null,null,"",null,null,null,null,null,null,null,null,null,null,null,null,null,null,null,null,null,null,null,null,null,null,null,null,null,null,null,null,null,null,null,null,null,null,null,{"$f":"IF(DE153=1,\"* No olvide escribir en las celdas de \"\"Pueblos Originarios\"\" (Digite Cero si no tiene).\",\"\")","v":""},{"$f":"IF(DF153=1,\"* No olvide escribir en las celdas de \"\"Población Migrante\"\" (Digite Cero si no tiene).\",\"\")","v":""},{"$f":"IF(DG153=1,\"* La suma de las celdas de \"\"Pueblos Originarios\"\"no debe superar el Total.\",\"\")","v":""},{"$f":"IF(DH153=1,\"* La suma de las celdas de \"\"Población Migrante\"\" no debe superar el Total.\",\"\")","v":""},null,null,null,null,null,null,null,null,null,null,null,null,null,null,null,null,null,null,null,null,null,{"$f":"IF(AND($C153<>0,OR(AR153=\"\",AS153=\"\")),1,0)","v":0},{"$f":"IF(AND($C153<>0,OR(AT153=\"\",AU153=\"\")),1,0)","v":0},{"$f":"IF((AR153+AS153)>$C153,1,0)","v":0},{"$f":"IF((AU153+AT153)>$C153,1,0)","v":0}]
["Trastornos genéticos  ","Trastornos genéticos  ",0,0,0,null,null,null,null,null,null,null,null,null,null,null,null,null,null,null,null,null,null,null,null,null,null,null,null,null,null,null,null,null,null,null,null,null,null,null,null,null,null,null,null,null,null,""]
["Alergias alimentarias","Alergias alimentarias",0,0,0,null,null,null,null,null,null,null,null,null,null,null,null,null,null,null,null,null,null,null,null,null,null,null,null,null,null,null,null,null,null,null,null,null,null,null,null,null,null,null,null,null,null,""]
["Enfermedades del sistema inmunitario (no incluye asma, ni alergias alimentarias) ","Enfermedades del sistema inmunitario (no incluye asma, ni alergias alimentarias) ",0,0,0,null,null,null,null,null,null,null,null,null,null,null,null,null,null,null,null,null,null,null,null,null,null,null,null,null,null,null,null,null,null,null,null,null,null,null,null,null,null,null,null,null,null,""]
["Fibrosis Quística ","Fibrosis Quística ",0,0,0,null,null,null,null,null,null,null,null,null,null,null,null,null,null,null,null,null,null,null,null,null,null,null,null,null,null,null,null,null,null,null,null,null,null,null,null,null,null,null,null,null,null,""]
["Asma","Asma",0,0,0,null,null,null,null,null,null,null,null,null,null,null,null,null,null,null,null,null,null,null,null,null,null,null,null,null,null,null,null,null,null,null,null,null,null,null,null,null,null,null,null,null,null,""]
["Otras Enfermedades respiratorias crónicas (no incluye Asma, ni Fibrosis Quística) ","Otras Enfermedades respiratorias crónicas (no incluye Asma, ni Fibrosis Quística) ",0,0,0,null,null,null,null,null,null,null,null,null,null,null,null,null,null,null,null,null,null,null,null,null,null,null,null,null,null,null,null,null,null,null,null,null,null,null,null,null,null,null,null,null,null,""]
["Oxigenoterapia Ambulatoria ","Oxigenoterapia Ambulatoria ",0,0,0,null,null,null,null,null,null,null,null,null,null,null,null,null,null,null,null,null,null,null,null,null,null,null,null,null,null,null,null,null,null,null,null,null,null,null,null,null,null,null,null,null,null,""]
["Asistencia ventilatoria Invasiva y No invasiva ","Asistencia ventilatoria Invasiva y No invasiva ",0,0,0,null,null,null,null,null,null,null,null,null,null,null,null,null,null,null,null,null,null,null,null,null,null,null,null,null,null,null,null,null,null,null,null,null,null,null,null,null,null,null,null,null,null,""]
["Enfermedad renal crónica ","Enfermedad renal crónica ",0,0,0,null,null,null,null,null,null,null,null,null,null,null,null,null,null,null,null,null,null,null,null,null,null,null,null,null,null,null,null,null,null,null,null,null,null,null,null,null,null,null,null,null,null,""]
["Hipertensión Arterial (En vez de Presión Arterial Elevada) ","Hipertensión Arterial (En vez de Presión Arterial Elevada) ",0,0,0,null,null,null,null,null,null,null,null,null,null,null,null,null,null,null,null,null,null,null,null,null,null,null,null,null,null,null,null,null,null,null,null,null,null,null,null,null,null,null,null,null,null,""]
["Cardiopatía congénita","Cardiopatía congénita",0,0,0,null,null,null,null,null,null,null,null,null,null,null,null,null,null,null,null,null,null,null,null,null,null,null,null,null,null,null,null,null,null,null,null,null,null,null,null,null,null,null,null,null,null,""]
["Otras Enfermedades cardiovasculares crónicas (no incluye Hipertensión Arterial ni Cardiopatías Congénitas)","Otras Enfermedades cardiovasculares crónicas (no incluye Hipertensión Arterial ni Cardiopatías Congénitas)",0,0,0,null,null,null,null,null,null,null,null,null,null,null,null,null,null,null,null,null,null,null,null,null,null,null,null,null,null,null,null,null,null,null,null,null,null,null,null,null,null,null,null,null,null,""]
["Enfermedad celiaca ","Enfermedad celiaca ",0,0,0,null,null,null,null,null,null,null,null,null,null,null,null,null,null,null,null,null,null,null,null,null,null,null,null,null,null,null,null,null,null,null,null,null,null,null,null,null,null,null,null,null,null,""]
["Enfermedades crónicas gastrointestinales (no incluye enfermedad celiaca)","Enfermedades crónicas gastrointestinales (no incluye enfermedad celiaca)",0,0,0,null,null,null,null,null,null,null,null,null,null,null,null,null,null,null,null,null,null,null,null,null,null,null,null,null,null,null,null,null,null,null,null,null,null,null,null,null,null,null,null,null,null,""]
["Estrabismo ","Estrabismo ",0,0,0,null,null,null,null,null,null,null,null,null,null,null,null,null,null,null,null,null,null,null,null,null,null,null,null,null,null,null,null,null,null,null,null,null,null,null,null,null,null,null,null,null,null,""]
["Errores de refracción","Errores de refracción",0,0,0,null,null,null,null,null,null,null,null,null,null,null,null,null,null,null,null,null,null,null,null,null,null,null,null,null,null,null,null,null,null,null,null,null,null,null,null,null,null,null,null,null,null,""]
["Enfermedades crónicas del sistema visual (no incluye estrabismo ni errores de refracción)","Enfermedades crónicas del sistema visual (no incluye Estabismo ni Errores de Refracción)",0,0,0,null,null,null,null,null,null,null,null,null,null,null,null,null,null,null,null,null,null,null,null,null,null,null,null,null,null,null,null,null,null,null,null,null,null,null,null,null,null,null,null,null,null,"",null,null,null,null,null,null,null,null,null,null,null,null,null,null,null,null,null,null,null,null,null,null,null,null,null,null,null,null,null,null,null,null,null,null,null,{"$f":"IF(DE170=1,\"* No olvide escribir en las celdas de \"\"Pueblos Originarios\"\" (Digite Cero si no tiene).\",\"\")","v":""},{"$f":"IF(DF170=1,\"* No olvide escribir en las celdas de \"\"Población Migrante\"\" (Digite Cero si no tiene).\",\"\")","v":""},{"$f":"IF(DG170=1,\"* La suma de las celdas de \"\"Pueblos Originarios\"\"no debe superar el Total.\",\"\")","v":""},{"$f":"IF(DH170=1,\"* La suma de las celdas de \"\"Población Migrante\"\" no debe superar el Total.\",\"\")","v":""},null,null,null,null,null,null,null,null,null,null,null,null,null,null,null,null,null,null,null,null,null,{"$f":"IF(AND($C170<>0,OR(AR170=\"\",AS170=\"\")),1,0)","v":0},{"$f":"IF(AND($C170<>0,OR(AT170=\"\",AU170=\"\")),1,0)","v":0},{"$f":"IF((AR170+AS170)>$C170,1,0)","v":0},{"$f":"IF((AU170+AT170)>$C170,1,0)","v":0}]
["Enfermedades crónicas del oído ","Enfermedades crónicas del oído ",0,0,0,null,null,null,null,null,null,null,null,null,null,null,null,null,null,null,null,null,null,null,null,null,null,null,null,null,null,null,null,null,null,null,null,null,null,null,null,null,null,null,null,null,null,"",null,null,null,null,null,null,null,null,null,null,null,null,null,null,null,null,null,null,null,null,null,null,null,null,null,null,null,null,null,null,null,null,null,null,null,"","","","",null,null,null,null,null,null,null,null,null,null,null,null,null,null,null,null,null,null,null,null,null,0,0,0,0]
["Enfermedades crónicas de piel y mucosas ","Enfermedades crónicas de piel y mucosas ",{"$f":"SUM(D172:E172)","v":0},{"$f":"+F172+H172+J172+L172+N172+P172+R172+T172+V172+X172+Z172+AB172+AD172+AF172+AH172+AN172+AP172+AJ172+AL172","v":0},0,null,null,null,null,null,null,null,null,null,null,null,null,null,null,null,null,null,null,null,null,null,null,null,null,null,null,null,null,null,null,null,null,null,null,null,null,null,null,null,null,null,null,{"$f":"CF172&CG172&CH172&CI172","v":""}]
["Enfermedades hematológicas crónicas ","Enfermedades hematológicas crónicas ",0,0,0,null,null,null,null,null,null,null,null,null,null,null,null,null,null,null,null,null,null,null,null,null,null,null,null,null,null,null,null,null,null,null,null,null,null,null,null,null,null,null,null,null,null,"",null,null,null,null,null,null,null,null,null,null,null,null,null,null,null,null,null,null,null,null,null,null,null,null,null,null,null,null,null,null,null,null,null,null,null,{"$f":"IF(DE173=1,\"* No olvide escribir en las celdas de \"\"Pueblos Originarios\"\" (Digite Cero si no tiene).\",\"\")","v":""},{"$f":"IF(DF173=1,\"* No olvide escribir en las celdas de \"\"Población Migrante\"\" (Digite Cero si no tiene).\",\"\")","v":""},{"$f":"IF(DG173=1,\"* La suma de las celdas de \"\"Pueblos Originarios\"\"no debe superar el Total.\",\"\")","v":""},{"$f":"IF(DH173=1,\"* La suma de las celdas de \"\"Población Migrante\"\" no debe superar el Total.\",\"\")","v":""},null,null,null,null,null,null,null,null,null,null,null,null,null,null,null,null,null,null,null,null,null,{"$f":"IF(AND($C173<>0,OR(AR173=\"\",AS173=\"\")),1,0)","v":0},{"$f":"IF(AND($C173<>0,OR(AT173=\"\",AU173=\"\")),1,0)","v":0},{"$f":"IF((AR173+AS173)>$C173,1,0)","v":0},{"$f":"IF((AU173+AT173)>$C173,1,0)","v":0}]
["Trastorno del Espectro Autista ","Trastorno del Espectro Autista ",0,0,0,null,null,null,null,null,null,null,null,null,null,null,null,null,null,null,null,null,null,null,null,null,null,null,null,null,null,null,null,null,null,null,null,null,null,null,null,null,null,null,null,null,null,"",null,null,null,null,null,null,null,null,null,null,null,null,null,null,null,null,null,null,null,null,null,null,null,null,null,null,null,null,null,null,null,null,null,null,null,{"$f":"IF(DE174=1,\"* No olvide escribir en las celdas de \"\"Pueblos Originarios\"\" (Digite Cero si no tiene).\",\"\")","v":""},{"$f":"IF(DF174=1,\"* No olvide escribir en las celdas de \"\"Población Migrante\"\" (Digite Cero si no tiene).\",\"\")","v":""},{"$f":"IF(DG174=1,\"* La suma de las celdas de \"\"Pueblos Originarios\"\"no debe superar el Total.\",\"\")","v":""},{"$f":"IF(DH174=1,\"* La suma de las celdas de \"\"Población Migrante\"\" no debe superar el Total.\",\"\")","v":""},null,null,null,null,null,null,null,null,null,null,null,null,null,null,null,null,null,null,null,null,null,{"$f":"IF(AND($C174<>0,OR(AR174=\"\",AS174=\"\")),1,0)","v":0},{"$f":"IF(AND($C174<>0,OR(AT174=\"\",AU174=\"\")),1,0)","v":0},{"$f":"IF((AR174+AS174)>$C174,1,0)","v":0},{"$f":"IF((AU174+AT174)>$C174,1,0)","v":0}]
["Síndrome de Rett ","Síndrome de Rett ",0,0,0,null,null,null,null,null,null,null,null,null,null,null,null,null,null,null,null,null,null,null,null,null,null,null,null,null,null,null,null,null,null,null,null,null,null,null,null,null,null,null,null,null,null,""]
["Parálisis Cerebral ","Parálisis Cerebral ",0,0,0,null,null,null,null,null,null,null,null,null,null,null,null,null,null,null,null,null,null,null,null,null,null,null,null,null,null,null,null,null,null,null,null,null,null,null,null,null,null,null,null,null,null,""]
["Epilepsia ","Epilepsia ",0,0,0,null,null,null,null,null,null,null,null,null,null,null,null,null,null,null,null,null,null,null,null,null,null,null,null,null,null,null,null,null,null,null,null,null,null,null,null,null,null,null,null,null,null,"",null,null,null,null,null,null,null,null,null,null,null,null,null,null,null,null,null,null,null,null,null,null,null,null,null,null,null,null,null,null,null,null,null,null,null,{"$f":"IF(DE177=1,\"* No olvide escribir en las celdas de \"\"Pueblos Originarios\"\" (Digite Cero si no tiene).\",\"\")","v":""},{"$f":"IF(DF177=1,\"* No olvide escribir en las celdas de \"\"Población Migrante\"\" (Digite Cero si no tiene).\",\"\")","v":""},{"$f":"IF(DG177=1,\"* La suma de las celdas de \"\"Pueblos Originarios\"\"no debe superar el Total.\",\"\")","v":""},{"$f":"IF(DH177=1,\"* La suma de las celdas de \"\"Población Migrante\"\" no debe superar el Total.\",\"\")","v":""},null,null,null,null,null,null,null,null,null,null,null,null,null,null,null,null,null,null,null,null,null,{"$f":"IF(AND($C177<>0,OR(AR177=\"\",AS177=\"\")),1,0)","v":0},{"$f":"IF(AND($C177<>0,OR(AT177=\"\",AU177=\"\")),1,0)","v":0},{"$f":"IF((AR177+AS177)>$C177,1,0)","v":0},{"$f":"IF((AU177+AT177)>$C177,1,0)","v":0}]
["Otros trastornos del Neurodesarrollo (no incluye TEA) ","Otros trastornos del Neurodesarrollo  ( no incluye TEA)",0,0,0,null,null,null,null,null,null,null,null,null,null,null,null,null,null,null,null,null,null,null,null,null,null,null,null,null,null,null,null,null,null,null,null,null,null,null,null,null,null,null,null,null,null,""]
["Otras Enfermedades crónicas neurológicas (No incluye síndrome de Rett, Paráisis Cerebral, Epilepsia, TEA)","Otras Enfermedades crónicas neurológicas (No incluye síndrome de Rett, Parálisis Cerebral, Epiepsia, TEA)",0,0,0,null,null,null,null,null,null,null,null,null,null,null,null,null,null,null,null,null,null,null,null,null,null,null,null,null,null,null,null,null,null,null,null,null,null,null,null,null,null,null,null,null,null,"",null,null,null,null,null,null,null,null,null,null,null,null,null,null,null,null,null,null,null,null,null,null,null,null,null,null,null,null,null,null,null,null,null,null,null,{"$f":"IF(DE179=1,\"* No olvide escribir en las celdas de \"\"Pueblos Originarios\"\" (Digite Cero si no tiene).\",\"\")","v":""},{"$f":"IF(DF179=1,\"* No olvide escribir en las celdas de \"\"Población Migrante\"\" (Digite Cero si no tiene).\",\"\")","v":""},{"$f":"IF(DG179=1,\"* La suma de las celdas de \"\"Pueblos Originarios\"\"no debe superar el Total.\",\"\")","v":""},{"$f":"IF(DH179=1,\"* La suma de las celdas de \"\"Población Migrante\"\" no debe superar el Total.\",\"\")","v":""},null,null,null,null,null,null,null,null,null,null,null,null,null,null,null,null,null,null,null,null,null,{"$f":"IF(AND($C179<>0,OR(AR179=\"\",AS179=\"\")),1,0)","v":0},{"$f":"IF(AND($C179<>0,OR(AT179=\"\",AU179=\"\")),1,0)","v":0},{"$f":"IF((AR179+AS179)>$C179,1,0)","v":0},{"$f":"IF((AU179+AT179)>$C179,1,0)","v":0}]
["Disrrafias espinales","Disrafias espinales",0,0,0,null,null,null,null,null,null,null,null,null,null,null,null,null,null,null,null,null,null,null,null,null,null,null,null,null,null,null,null,null,null,null,null,null,null,null,null,null,null,null,null,null,null,"",null,null,null,null,null,null,null,null,null,null,null,null,null,null,null,null,null,null,null,null,null,null,null,null,null,null,null,null,null,null,null,null,null,null,null,{"$f":"IF(DE180=1,\"* No olvide escribir en las celdas de \"\"Pueblos Originarios\"\" (Digite Cero si no tiene).\",\"\")","v":""},{"$f":"IF(DF180=1,\"* No olvide escribir en las celdas de \"\"Población Migrante\"\" (Digite Cero si no tiene).\",\"\")","v":""},{"$f":"IF(DG180=1,\"* La suma de las celdas de \"\"Pueblos Originarios\"\"no debe superar el Total.\",\"\")","v":""},{"$f":"IF(DH180=1,\"* La suma de las celdas de \"\"Población Migrante\"\" no debe superar el Total.\",\"\")","v":""},null,null,null,null,null,null,null,null,null,null,null,null,null,null,null,null,null,null,null,null,null,{"$f":"IF(AND($C180<>0,OR(AR180=\"\",AS180=\"\")),1,0)","v":0},{"$f":"IF(AND($C180<>0,OR(AT180=\"\",AU180=\"\")),1,0)","v":0},{"$f":"IF((AR180+AS180)>$C180,1,0)","v":0},{"$f":"IF((AU180+AT180)>$C180,1,0)","v":0}]
["Malformaciones congénitas y deformidades","Malformaciones congénitas y deformidades",0,0,0,null,null,null,null,null,null,null,null,null,null,null,null,null,null,null,null,null,null,null,null,null,null,null,null,null,null,null,null,null,null,null,null,null,null,null,null,null,null,null,null,null,null,""]
["Escoliosis","Escoliosis",0,0,0,null,null,null,null,null,null,null,null,null,null,null,null,null,null,null,null,null,null,null,null,null,null,null,null,null,null,null,null,null,null,null,null,null,null,null,null,null,null,null,null,null,null,""]
["Displasia luxante de caderas","Displasia luxante de caderas",0,0,0,null,null,null,null,null,null,null,null,null,null,null,null,null,null,null,null,null,null,null,null,null,null,null,null,null,null,null,null,null,null,null,null,null,null,null,null,null,null,null,null,null,null,"",null,null,null,null,null,null,null,null,null,null,null,null,null,null,null,null,null,null,null,null,null,null,null,null,null,null,null,null,null,null,null,null,null,null,null,{"$f":"IF(DE183=1,\"* No olvide escribir en las celdas de \"\"Pueblos Originarios\"\" (Digite Cero si no tiene).\",\"\")","v":""},{"$f":"IF(DF183=1,\"* No olvide escribir en las celdas de \"\"Población Migrante\"\" (Digite Cero si no tiene).\",\"\")","v":""},{"$f":"IF(DG183=1,\"* La suma de las celdas de \"\"Pueblos Originarios\"\"no debe superar el Total.\",\"\")","v":""},{"$f":"IF(DH183=1,\"* La suma de las celdas de \"\"Población Migrante\"\" no debe superar el Total.\",\"\")","v":""},null,null,null,null,null,null,null,null,null,null,null,null,null,null,null,null,null,null,null,null,null,{"$f":"IF(AND($C183<>0,OR(AR183=\"\",AS183=\"\")),1,0)","v":0},{"$f":"IF(AND($C183<>0,OR(AT183=\"\",AU183=\"\")),1,0)","v":0},{"$f":"IF((AR183+AS183)>$C183,1,0)","v":0},{"$f":"IF((AU183+AT183)>$C183,1,0)","v":0}]
["Enfermedades musculoesqueléticas crónicas ","Enfermedades musculoesqueléticas crónicas ",0,0,{"$f":"+G184+I184+K184+M184+O184+Q184+S184+U184+W184+Y184+AA184+AC184+AE184+AG184+AI184+AO184+AQ184+AK184+AM184","v":0},null,null,null,null,null,null,null,null,null,null,null,null,null,null,null,null,null,null,null,null,null,null,null,null,null,null,null,null,null,null,null,null,null,null,null,null,null,null,null,null,null,null,""]
["Neoplasias  ","Neoplasias  ",0,0,0,null,null,null,null,null,null,null,null,null,null,null,null,null,null,null,null,null,null,null,null,null,null,null,null,null,null,null,null,null,null,null,null,null,null,null,null,null,null,null,null,null,null,"",null,null,null,null,null,null,null,null,null,null,null,null,null,null,null,null,null,null,null,null,null,null,null,null,null,null,null,null,null,null,null,null,null,null,null,{"$f":"IF(DE185=1,\"* No olvide escribir en las celdas de \"\"Pueblos Originarios\"\" (Digite Cero si no tiene).\",\"\")","v":""},{"$f":"IF(DF185=1,\"* No olvide escribir en las celdas de \"\"Población Migrante\"\" (Digite Cero si no tiene).\",\"\")","v":""},{"$f":"IF(DG185=1,\"* La suma de las celdas de \"\"Pueblos Originarios\"\"no debe superar el Total.\",\"\")","v":""},{"$f":"IF(DH185=1,\"* La suma de las celdas de \"\"Población Migrante\"\" no debe superar el Total.\",\"\")","v":""},null,null,null,null,null,null,null,null,null,null,null,null,null,null,null,null,null,null,null,null,null,{"$f":"IF(AND($C185<>0,OR(AR185=\"\",AS185=\"\")),1,0)","v":0},{"$f":"IF(AND($C185<>0,OR(AT185=\"\",AU185=\"\")),1,0)","v":0},{"$f":"IF((AR185+AS185)>$C185,1,0)","v":0},{"$f":"IF((AU185+AT185)>$C185,1,0)","v":0}]
["Cuidados paliativos","Cuidados paliativos",0,0,0,null,null,null,null,null,null,null,null,null,null,null,null,null,null,null,null,null,null,null,null,null,null,null,null,null,null,null,null,null,null,null,null,null,null,null,null,null,null,null,null,null,null,"",null,null,null,null,null,null,null,null,null,null,null,null,null,null,null,null,null,null,null,null,null,null,null,null,null,null,null,null,null,null,null,null,null,null,null,{"$f":"IF(DE186=1,\"* No olvide escribir en las celdas de \"\"Pueblos Originarios\"\" (Digite Cero si no tiene).\",\"\")","v":""},{"$f":"IF(DF186=1,\"* No olvide escribir en las celdas de \"\"Población Migrante\"\" (Digite Cero si no tiene).\",\"\")","v":""},{"$f":"IF(DG186=1,\"* La suma de las celdas de \"\"Pueblos Originarios\"\"no debe superar el Total.\",\"\")","v":""},{"$f":"IF(DH186=1,\"* La suma de las celdas de \"\"Población Migrante\"\" no debe superar el Total.\",\"\")","v":""},null,null,null,null,null,null,null,null,null,null,null,null,null,null,null,null,null,null,null,null,null,{"$f":"IF(AND($C186<>0,OR(AR186=\"\",AS186=\"\")),1,0)","v":0},{"$f":"IF(AND($C186<>0,OR(AT186=\"\",AU186=\"\")),1,0)","v":0},{"$f":"IF((AR186+AS186)>$C186,1,0)","v":0},{"$f":"IF((AU186+AT186)>$C186,1,0)","v":0}]
["Hospitalización Domiciliaria  ","Hospitalización Domiciliaria  ",0,0,0,null,null,null,null,null,null,null,null,null,null,null,null,null,null,null,null,null,null,null,null,null,null,null,null,null,null,null,null,null,null,null,null,null,null,null,null,null,null,null,null,null,null,""]
["Gran Quemado","Gran Quemado",0,0,0,null,null,null,null,null,null,null,null,null,null,null,null,null,null,null,null,null,null,null,null,null,null,null,null,null,null,null,null,null,null,null,null,null,null,null,null,null,null,null,null,null,null,""]
["Otras condiciones asociadas a NANEAS ","Otras condiciones asociadas a NANEAS ",0,0,0,null,null,null,null,null,null,null,null,null,null,null,null,null,null,null,null,null,null,null,null,null,null,null,null,null,null,null,null,null,null,null,null,null,null,null,null,null,null,null,null,null,null,"",null,null,null,null,null,null,null,null,null,null,null,null,null,null,null,null,null,null,null,null,null,null,null,null,null,null,null,null,null,null,null,null,null,null,null,"","","","",null,null,null,null,null,null,null,null,null,null,null,null,null,null,null,null,null,null,null,null,null,0,0,0,0]
[]
["SECCION I: POBLACIÓN SEGÚN NIVEL DE COMPLEJIDAD DE NIÑOS, NIÑAS Y ADOLESCENTES CON NECESIDADES ESPECIALES DE ATENCIÓN EN SALUD (NANEAS) (Incluida en sección A y A1)"]
["NIVELES DE COMPLEJIDAD",null,"TOTAL",null,null,"GRUPOS DE EDAD (en meses - años) Y SEXO",null,null,null,null,null,null,null,null,null,null,null,null,null,null,null,null,null,null,null,null,null,null,null,null,null,null,null,null,null,null,null,null,null,null,null,null,null,"Pueblos Originarios",null,"Población Migrantes"]
[null,null,null,null,null,"Menor de 1 mes",null,"1 mes",null,"2 meses",null,"3 meses",null,"4 meses",null,"5 meses",null,"6 meses",null,"7 a 11 meses",null,"12 a 17 meses",null,"18 a 23 meses",null,"24 a 35 meses",null,"36 a 41 meses",null,"42 a 47 meses",null,"48 a 59 meses",null,"60 a 71 meses",null,"6 a 7 años",null,"8 a 9 años",null,"10 a 14 años",null,"15 a 19 años"]
[null,null,"Ambos sexos","Hombres","Mujeres","Hombres","Mujeres","Hombres","Mujeres","Hombres","Mujeres","Hombres","Mujeres","Hombres","Mujeres","Hombres","Mujeres","Hombres","Mujeres","Hombres","Mujeres","Hombres","Mujeres","Hombres","Mujeres","Hombres","Mujeres","Hombres","Mujeres","Hombres","Mujeres","Hombres","Mujeres","Hombres","Mujeres","Hombres","Mujeres","Hombres","Mujeres","Hombres","Mujeres","Hombres","Mujeres","Hombres","Mujeres","Hombres","Mujeres"]
["TOTAL POBLACIÓN NANES BAJO CONTROL",null,{"$f":"SUM(D195:E195)","v":0},{"$f":"+F195+H195+J195+L195+N195+P195+R195+T195+V195+X195+Z195+AB195+AD195+AF195+AH195+AN195+AP195+AJ195+AL195","v":0},{"$f":"+G195+I195+K195+M195+O195+Q195+S195+U195+W195+Y195+AA195+AC195+AE195+AG195+AI195+AO195+AQ195+AK195+AM195","v":0},{"$f":"SUM(F196:F198)","v":0},0,0,0,0,0,0,0,0,0,0,0,0,0,0,0,0,0,0,0,0,0,0,0,0,0,0,0,0,0,0,0,0,0,0,0,0,0,0,0,0,0]
["ALTA COMPLEJIDAD",null,{"$f":"SUM(D196:E196)","v":0},{"$f":"+F196+H196+J196+L196+N196+P196+R196+T196+V196+X196+Z196+AB196+AD196+AF196+AH196+AN196+AP196+AJ196+AL196","v":0},{"$f":"+G196+I196+K196+M196+O196+Q196+S196+U196+W196+Y196+AA196+AC196+AE196+AG196+AI196+AO196+AQ196+AK196+AM196","v":0},null,null,null,null,null,null,null,null,null,null,null,null,null,null,null,null,null,null,null,null,null,null,null,null,null,null,null,null,null,null,null,null,null,null,null,null,null,null,null,null,null,null,{"$f":"CF196&CG196&CH196&CI196","v":""},null,null,null,null,null,null,null,null,null,null,null,null,null,null,null,null,null,null,null,null,null,null,null,null,null,null,null,null,null,null,null,null,null,null,null,{"$f":"IF(DE196=1,\"* No olvide escribir en las celdas de \"\"Pueblos Originarios\"\" (Digite Cero si no tiene).\",\"\")","v":""},{"$f":"IF(DF196=1,\"* No olvide escribir en las celdas de \"\"Población Migrante\"\" (Digite Cero si no tiene).\",\"\")","v":""},{"$f":"IF(DG196=1,\"* La suma de las celdas de \"\"Pueblos Originarios\"\"no debe superar el Total.\",\"\")","v":""},{"$f":"IF(DH196=1,\"* La suma de las celdas de \"\"Población Migrante\"\" no debe superar el Total.\",\"\")","v":""},null,null,null,null,null,null,null,null,null,null,null,null,null,null,null,null,null,null,null,null,null,{"$f":"IF(AND($C196<>0,OR(AR196=\"\",AS196=\"\")),1,0)","v":0},{"$f":"IF(AND($C196<>0,OR(AT196=\"\",AU196=\"\")),1,0)","v":0},{"$f":"IF((AR196+AS196)>$C196,1,0)","v":0},{"$f":"IF((AU196+AT196)>$C196,1,0)","v":0}]
["MEDIANA COMPLEJIDAD",null,{"$f":"SUM(D197:E197)","v":0},{"$f":"+F197+H197+J197+L197+N197+P197+R197+T197+V197+X197+Z197+AB197+AD197+AF197+AH197+AN197+AP197+AJ197+AL197","v":0},{"$f":"+G197+I197+K197+M197+O197+Q197+S197+U197+W197+Y197+AA197+AC197+AE197+AG197+AI197+AO197+AQ197+AK197+AM197","v":0},null,null,null,null,null,null,null,null,null,null,null,null,null,null,null,null,null,null,null,null,null,null,null,null,null,null,null,null,null,null,null,null,null,null,null,null,null,null,null,null,null,null,{"$f":"CF197&CG197&CH197&CI197","v":""},null,null,null,null,null,null,null,null,null,null,null,null,null,null,null,null,null,null,null,null,null,null,null,null,null,null,null,null,null,null,null,null,null,null,null,{"$f":"IF(DE197=1,\"* No olvide escribir en las celdas de \"\"Pueblos Originarios\"\" (Digite Cero si no tiene).\",\"\")","v":""},{"$f":"IF(DF197=1,\"* No olvide escribir en las celdas de \"\"Población Migrante\"\" (Digite Cero si no tiene).\",\"\")","v":""},{"$f":"IF(DG197=1,\"* La suma de las celdas de \"\"Pueblos Originarios\"\"no debe superar el Total.\",\"\")","v":""},{"$f":"IF(DH197=1,\"* La suma de las celdas de \"\"Población Migrante\"\" no debe superar el Total.\",\"\")","v":""},null,null,null,null,null,null,null,null,null,null,null,null,null,null,null,null,null,null,null,null,null,{"$f":"IF(AND($C197<>0,OR(AR197=\"\",AS197=\"\")),1,0)","v":0},{"$f":"IF(AND($C197<>0,OR(AT197=\"\",AU197=\"\")),1,0)","v":0},{"$f":"IF((AR197+AS197)>$C197,1,0)","v":0},{"$f":"IF((AU197+AT197)>$C197,1,0)","v":0}]
["BAJA COMPLEJIDAD",null,0,0,0,null,null,null,null,null,null,null,null,null,null,null,null,null,null,null,null,null,null,null,null,null,null,null,null,null,null,null,null,null,null,null,null,null,null,null,null,null,null,null,null,null,null,"",null,null,null,null,null,null,null,null,null,null,null,null,null,null,null,null,null,null,null,null,null,null,null,null,null,null,null,null,null,null,null,null,null,null,null,"","","","",null,null,null,null,null,null,null,null,null,null,null,null,null,null,null,null,null,null,null,null,null,0,0,0,0]
[]
["SECCION J: POBLACIÓN EN CONTROL, SEGÚN RIESGO ODONTOLÓGICO Y DAÑO POR CARIES"]
["INDICADOR ODONTOLÓGICO\nY\nPARÁMETROS DE MEDICIÓN",null,"TOTAL",null,null,"GRUPOS DE EDAD  Y SEXO",null,null,null,null,null,null,null,null,null,null,null,null,null,null,null,null,null,null,null,"Pueblos Originarios",null,"Población Migrantes",null,"Usuarios con Discapacidad",null,"Niños y Niñas Red Mejor Niñez",null,"Niños y Niñas Red SENAME"]
[null,null,null,null,null,"< 1 AÑO",null,"1 AÑO",null,"2 AÑOS",null,"3 AÑOS",null,"4 AÑOS",null,"5 AÑOS",null,"6 AÑOS",null,"7 AÑOS",null,"8 AÑOS",null,"9 AÑOS "]
[null,null,"Ambos sexos","Hombres","Mujeres","Hombres","Mujeres","Hombres","Mujeres","Hombres","Mujeres","Hombres","Mujeres","Hombres","Mujeres","Hombres","Mujeres","Hombres","Mujeres","Hombres","Mujeres","Hombres","Mujeres","Hombres","Mujeres","Hombres","Mujeres","Hombres","Mujeres","Hombres","Mujeres","Hombres","Mujeres","Hombres","Mujeres"]
["TOTAL DE NIÑOS(AS) EN CONTROL CON ENFOQUE DE RIESGO ODONTOLÓGICO",null,{"$f":"SUM(D204:E204)","v":0},{"$f":"+F204+H204+J204+L204+N204+P204+R204+T204+V204+X204","v":0},{"$f":"+G204+I204+K204+M204+O204+Q204+S204+U204+W204+Y204","v":0},{"$f":"+F207+F214","v":0},{"$f":"+G207+G214","v":0},0,0,0,0,0,0,0,0,0,0,0,0,0,0,0,0,0,0,0,0,0,0,0,0,0,0,0,{"$f":"+AI207+AI214","v":0}]
["EVALUACIÓN DE RIESGO SEGÚN PAUTA CERO","ALTO RIESGO ",0,0,{"$f":"+G205+I205+K205+M205+O205+Q205+S205+U205+W205+Y205","v":0}]
[null,"BAJO RIESGO ",0,0,0]
[null,"TOTAL ",{"$f":"SUM(D207:E207)","v":0},{"$f":"+F207+H207+J207+L207+N207+P207+R207+T207+V207+X207","v":0},{"$f":"+G207+I207+K207+M207+O207+Q207+S207+U207+W207+Y207","v":0},{"$f":"SUM(F205:F206)","v":0},{"$f":"SUM(G205:G206)","v":0},0,0,0,0,0,0,0,0,0,0,0,0,0,0,0,0,0,0,0,0,0,0,0,0,0,0,0,0]
["EVALUACIÓN DE DAÑO POR CARIES SEGÚN ÍNDICE ceod O COPD",0,{"$f":"SUM(D208:E208)","v":0},{"$f":"+F208+H208+J208+L208+N208+P208+R208+T208+V208+X208","v":0},{"$f":"+G208+I208+K208+M208+O208+Q208+S208+U208+W208+Y208","v":0}]
[null,"1 a 2",0,0,0]
[null,"3 a 4",0,0,0]
[null,"5 a 6",0,0,0]
[null,"7 a 8",0,0,0]
[null,"9 o más",0,0,0]
[null,"TOTAL ",0,0,0,{"$f":"SUM(F208:F213)","v":0},{"$f":"SUM(G208:G213)","v":0},0,0,0,0,0,0,0,0,0,0,0,0,0,0,0,0,0,0,0,0,0,0,0,0,0,0,0,0]
["INASISTENTES A CONTROL ODONTOLÓGICO",null,{"$f":"SUM(D215:E215)","v":0},0,0]

{"sheet":"P3","index":3,"n_rows":87,"n_cols":96,"rows_kept":87,"cut":false,"hidden":false,"merged":[[8,42,9,43],[47,5,47,6],[55,23,55,24],[55,25,55,26],[55,35,55,36],[55,37,55,38],[47,17,47,18],[55,21,55,22],[47,31,47,32],[47,33,47,34],[8,39,10,39],[9,7,9,8],[9,9,9,10],[9,11,9,12],[9,13,9,14],[9,31,9,32],[9,33,9,34],[8,5,8,38],[9,35,9,36],[9,17,9,18],[9,37,9,38],[9,15,9,16],[9,29,9,30],[9,25,9,26],[47,11,47,12],[53,0,53,38],[47,9,47,10],[61,0,63,0],[55,27,55,28],[55,29,55,30],[55,7,55,8],[55,9,55,10],[55,11,55,12],[55,13,55,14],[55,15,55,16],[55,17,55,18],[55,19,55,20],[57,0,60,0],[55,5,55,6],[47,7,47,8],[55,31,55,32],[55,33,55,34],[54,0,56,1],[54,2,55,4],[54,5,54,38],[47,29,47,30],[46,2,47,4],[11,0,13,0],[14,0,16,0],[17,0,18,0],[25,0,25,1],[30,0,30,1],[20,0,20,1],[34,0,39,0],[42,3,43,3],[28,0,28,1],[29,0,29,1],[21,0,21,1],[22,0,22,1],[23,0,23,1],[31,0,33,0],[26,0,26,1],[27,0,27,1],[41,0,41,41],[42,4,42,10],[42,1,43,1],[42,2,43,2],[66,35,66,36],[8,40,9,41],[65,1,67,1],[65,2,66,4],[6,0,6,24],[8,0,10,1],[8,2,9,4],[9,19,9,20],[9,5,9,6],[9,23,9,24],[9,21,9,22],[45,0,45,38],[47,13,47,14],[47,35,47,36],[47,23,47,24],[47,19,47,20],[47,21,47,22],[47,25,47,26],[47,15,47,16],[47,37,47,38],[46,5,46,38],[47,27,47,28],[9,27,9,28],[19,0,19,1],[65,0,67,0],[68,0,70,0],[71,0,73,0],[74,0,76,0],[46,0,48,1],[49,0,52,0],[42,0,43,0],[65,5,65,38],[66,37,66,38],[66,17,66,18],[66,19,66,20],[66,5,66,6],[66,7,66,8],[66,9,66,10],[66,11,66,12],[66,13,66,14],[66,15,66,16],[66,21,66,22],[66,23,66,24],[66,25,66,26],[66,27,66,28],[66,29,66,30],[66,31,66,32],[66,33,66,34]]}
["DATOS DEL ESTABLECIMIENTO"]
[{"$f":"CONCATENATE(\"COMUNA: \",NOMBRE!$B$2,\" - \",\"( \",NOMBRE!$C$2,NOMBRE!$D$2,NOMBRE!$E$2,NOMBRE!$F$2,NOMBRE!$G$2,\" )\")","v":"COMUNA:  - (  )"}]
[{"$f":"CONCATENATE(\"ESTABLECIMIENTO/ESTRATEGIA: \",NOMBRE!$B$3,\" - \",\"( \",NOMBRE!$C$3,NOMBRE!$D$3,NOMBRE!$E$3,NOMBRE!$F$3,NOMBRE!$G$3,NOMBRE!$H$3,\" )\")","v":"ESTABLECIMIENTO/ESTRATEGIA:  - (  )"}]
[{"$f":"CONCATENATE(\"MES: \",NOMBRE!$B$6,\" - \",\"( \",NOMBRE!$C$6,NOMBRE!$D$6,\" )\")","v":"MES:  - (  )"}]
[{"$f":"CONCATENATE(\"AÑO: \",NOMBRE!$B$7)","v":"AÑO: 2023"}]
[]
["REM-P3. POBLACIÓN EN CONTROL OTROS PROGRAMAS"]
["SECCIÓN A: EXISTENCIA DE POBLACIÓN EN CONTROL"]
["PROGRAMAS",null,"TOTAL",null,null,"GRUPOS DE EDAD (en años) Y SEXO",null,null,null,null,null,null,null,null,null,null,null,null,null,null,null,null,null,null,null,null,null,null,null,null,null,null,null,null,null,null,null,null,null,"Con espirometría vigente","Pueblos Originarios",null,"Migrantes"]
[null,null,null,null,null,"0 a 4 años",null,"5 a 9 años",null,"10 a 14 años",null,"15 a 19 años",null,"20 a 24 años",null,"25 a 29 años",null,"30 a 34 años",null,"35 a 39 años",null,"40 a 44 años",null,"45 a 49 años",null,"50 a 54 años",null,"55 a 59 años",null,"60 a 64 años",null,"65 a 69 años",null,"70 a 74 años",null,"75 a 79 años",null,"80 y más años"]
[null,null,"Ambos\nsexos","Hombres","Mujeres","Hombres","Mujeres","Hombres","Mujeres","Hombres","Mujeres","Hombres","Mujeres","Hombres","Mujeres","Hombres","Mujeres","Hombres","Mujeres","Hombres","Mujeres","Hombres","Mujeres","Hombres","Mujeres","Hombres","Mujeres","Hombres","Mujeres","Hombres","Mujeres","Hombres ","Mujeres","Hombres ","Mujeres","Hombres ","Mujeres","Hombres ","Mujeres",null,"Hombres ","Mujeres","Hombres ","Mujeres"]
["SÍNDROME BRONQUIAL OBSTRUCTIVA RECURRENTE (SBOR)","LEVE",{"$f":"SUM(D12:E12)","v":0},{"$f":"+F12","v":0},{"$f":"+G12","v":0},null,null,null,null,null,null,null,null,null,null,null,null,null,null,null,null,null,null,null,null,null,null,null,null,null,null,null,null,null,null,null,null,null,null,null,null,null,null,null,null,null,null,null,null,null,null,null,null,null,null,null,null,null,null,null,null,null,null,null,null,null,null,null,null,null,null,null,null,null,null,null,null,null,null,{"$f":"IF($AN12<=$F12+$G12,\"\",\"* La Población bajo control con Espirometría Vigente no debe ser mayor al Total de Población en Control. \")","v":""},{"$f":"IF($C12>=$AO12+$AP12,\"\",\"* La Población Migrantes no debe ser mayor al Total de Población en Control. \")","v":""},null,{"$f":"IF(AND(D12<>0,AO12=\"\"),\"* No olvide escribir en la celda de Población Migrantes (Digite CERO si no tiene). \",IF(AND(E12<>0,AP12=\"\"),\"* No olvide escribir en la celda de Población Migrantes (Digite CERO si no tiene). \",\"\"))","v":""},null,null,null,null,{"$f":"IF($AN12<=$F12+$G12,0,1)","v":0},{"$f":"IF($C12>=$AO12+$AP12,0,1)","v":0},null,{"$f":"IF(AND(D12<>0,AO12=\"\"),1,IF(AND(E12<>0,AP12=\"\"),1,0))","v":0}]
[null,"MODERADO",{"$f":"SUM(D13:E13)","v":0},{"$f":"+F13","v":0},{"$f":"+G13","v":0},null,null,null,null,null,null,null,null,null,null,null,null,null,null,null,null,null,null,null,null,null,null,null,null,null,null,null,null,null,null,null,null,null,null,null,null,null,null,null,null,null,null,null,null,null,null,null,null,null,null,null,null,null,null,null,null,null,null,null,null,null,null,null,null,null,null,null,null,null,null,null,null,null,null,{"$f":"IF($AN13<=$F13+$G13,\"\",\"* La Población bajo control con Espirometría Vigente no debe ser mayor al Total de Población en Control. \")","v":""},"",null,"",null,null,null,null,{"$f":"IF($AN13<=$F13+$G13,0,1)","v":0},{"$f":"IF($C13>=$AO13+$AP13,0,1)","v":0},null,0]
[null,"SEVERO",0,0,0,null,null,null,null,null,null,null,null,null,null,null,null,null,null,null,null,null,null,null,null,null,null,null,null,null,null,null,null,null,null,null,null,null,null,null,null,null,null,null,null,null,null,null,null,null,null,null,null,null,null,null,null,null,null,null,null,null,null,null,null,null,null,null,null,null,null,null,null,null,null,null,null,null,null,{"$f":"IF($AN14<=$F14+$G14,\"\",\"* La Población bajo control con Espirometría Vigente no debe ser mayor al Total de Población en Control. \")","v":""},"",null,"",null,null,null,null,{"$f":"IF($AN14<=$F14+$G14,0,1)","v":0},0,null,0]
["ASMA BRONQUIAL","LEVE",0,{"$f":"+F15+H15+J15+L15+N15+P15+R15+T15+V15+X15+Z15+AB15+AD15+AF15+AH15+AJ15+AL15","v":0},{"$f":"+G15+I15+K15+M15+O15+Q15+S15+U15+W15+Y15+AA15+AC15+AE15+AG15+AI15+AK15+AM15","v":0},null,null,null,null,null,null,null,null,null,null,null,null,null,null,null,null,null,null,null,null,null,null,null,null,null,null,null,null,null,null,null,null,null,null,null,null,null,null,null,null,null,null,null,null,null,null,null,null,null,null,null,null,null,null,null,null,null,null,null,null,null,null,null,null,null,null,null,null,null,null,null,null,null,null,{"$f":"IF($AN15<=SUM($F15:$AM15),\"\",\"* La Población bajo control con Espirometría Vigente no debe ser mayor al Total de Población en Control. \")","v":""},"",null,"",null,null,null,null,{"$f":"IF($AN15<=SUM($F15:$AM15),0,1)","v":0},0,null,0]
[null,"MODERADO",0,0,0,null,null,null,null,null,null,null,null,null,null,null,null,null,null,null,null,null,null,null,null,null,null,null,null,null,null,null,null,null,null,null,null,null,null,null,null,null,null,null,null,null,null,null,null,null,null,null,null,null,null,null,null,null,null,null,null,null,null,null,null,null,null,null,null,null,null,null,null,null,null,null,null,null,null,{"$f":"IF($AN16<=SUM($F16:$AM16),\"\",\"* La Población bajo control con Espirometría Vigente no debe ser mayor al Total de Población en Control. \")","v":""},"",null,"",null,null,null,null,{"$f":"IF($AN16<=SUM($F16:$AM16),0,1)","v":0},0,null,0]
[null,"SEVERO",0,0,0,null,null,null,null,null,null,null,null,null,null,null,null,null,null,null,null,null,null,null,null,null,null,null,null,null,null,null,null,null,null,null,null,null,null,null,null,null,null,null,null,null,null,null,null,null,null,null,null,null,null,null,null,null,null,null,null,null,null,null,null,null,null,null,null,null,null,null,null,null,null,null,null,null,null,{"$f":"IF($AN17<=SUM($F17:$AM17),\"\",\"* La Población bajo control con Espirometría Vigente no debe ser mayor al Total de Población en Control. \")","v":""},"",null,"",null,null,null,null,{"$f":"IF($AN17<=SUM($F17:$AM17),0,1)","v":0},0,null,0]
["ENFERMEDAD PULMONAR OBSTRUCTIVA CRÓNICA (EPOC)","TIPO A",{"$f":"SUM(D18:E18)","v":0},{"$f":"+V18+X18+Z18+AB18+AD18+AF18+AH18+AJ18+AL18","v":0},{"$f":"+W18+Y18+AA18+AC18+AE18+AG18+AI18+AK18+AM18","v":0},null,null,null,null,null,null,null,null,null,null,null,null,null,null,null,null,null,null,null,null,null,null,null,null,null,null,null,null,null,null,null,null,null,null,null,null,null,null,null,null,null,null,null,null,null,null,null,null,null,null,null,null,null,null,null,null,null,null,null,null,null,null,null,null,null,null,null,null,null,null,null,null,null,null,{"$f":"IF($AN18<=SUM($V18:$AM18),\"\",\"* La Población bajo control con Espirometría Vigente no debe ser mayor al Total de Población en Control. \")","v":""},"",null,"",null,null,null,null,{"$f":"IF($AN18<=SUM($V18:$AM18),0,1)","v":0},0,null,0]
[null,"TIPO B",{"$f":"SUM(D19:E19)","v":0},{"$f":"+V19+X19+Z19+AB19+AD19+AF19+AH19+AJ19+AL19","v":0},{"$f":"+W19+Y19+AA19+AC19+AE19+AG19+AI19+AK19+AM19","v":0},null,null,null,null,null,null,null,null,null,null,null,null,null,null,null,null,null,null,null,null,null,null,null,null,null,null,null,null,null,null,null,null,null,null,null,null,null,null,null,null,null,null,null,null,null,null,null,null,null,null,null,null,null,null,null,null,null,null,null,null,null,null,null,null,null,null,null,null,null,null,null,null,null,null,{"$f":"IF($AN19<=SUM($V19:$AM19),\"\",\"* La Población bajo control con Espirometría Vigente no debe ser mayor al Total de Población en Control. \")","v":""},"",null,"",null,null,null,null,{"$f":"IF($AN19<=SUM($V19:$AM19),0,1)","v":0},0,null,0]
["OTRAS RESPIRATORIAS CRONICAS",null,0,{"$f":"+F20+H20+J20+L20+N20+P20+R20+T20+V20+X20+Z20+AB20+AD20+AF20+AH20+AJ20+AL20","v":0},0,null,null,null,null,null,null,null,null,null,null,null,null,null,null,null,null,null,null,null,null,null,null,null,null,null,null,null,null,null,null,null,null,null,null,null,null,null,null,null,null,null,null,null,null,null,null,null,null,null,null,null,null,null,null,null,null,null,null,null,null,null,null,null,null,null,null,null,null,null,null,null,null,null,null,null,"",null,"",null,null,null,null,null,0,null,0]
["OXIGENO DEPENDIENTE",null,0,0,0,null,null,null,null,null,null,null,null,null,null,null,null,null,null,null,null,null,null,null,null,null,null,null,null,null,null,null,null,null,null,null,null,null,null,null,null,null,null,null,null,null,null,null,null,null,null,null,null,null,null,null,null,null,null,null,null,null,null,null,null,null,null,null,null,null,null,null,null,null,null,null,null,null,null,null,"",null,"",null,null,null,null,null,0,null,0]
["ASISTENCIA VENTILATORIA NO INVASIVA O INVASIVA ",null,{"$f":"SUM(D22:E22)","v":0},0,0,null,null,null,null,null,null,null,null,null,null,null,null,null,null,null,null,null,null,null,null,null,null,null,null,null,null,null,null,null,null,null,null,null,null,null,null,null,null,null,null,null,null,null,null,null,null,null,null,null,null,null,null,null,null,null,null,null,null,null,null,null,null,null,null,null,null,null,null,null,null,null,null,null,null,null,"",null,"",null,null,null,null,null,0,null,0]
["FIBROSIS QUÍSTICA ",null,{"$f":"SUM(D23:E23)","v":0},{"$f":"+F23+H23+J23+L23+N23+P23+R23+T23+V23+X23+Z23+AB23+AD23","v":0},{"$f":"+G23+I23+K23+M23+O23+Q23+S23+U23+W23+Y23+AA23+AC23+AE23","v":0},null,null,null,null,null,null,null,null,null,null,null,null,null,null,null,null,null,null,null,null,null,null,null,null,null,null,null,null,null,null,null,null,null,null,null,null,null,null,null,null,null,null,null,null,null,null,null,null,null,null,null,null,null,null,null,null,null,null,null,null,null,null,null,null,null,null,null,null,null,null,null,null,null,null,null,"",null,"",null,null,null,null,null,0,null,0]
["EPILEPSIA ",null,0,{"$f":"+F24+H24+J24+L24+N24+P24+R24+T24+V24+X24+Z24+AB24+AD24+AF24+AH24+AJ24+AL24","v":0},{"$f":"+G24+I24+K24+M24+O24+Q24+S24+U24+W24+Y24+AA24+AC24+AE24+AG24+AI24+AK24+AM24","v":0},null,null,null,null,null,null,null,null,null,null,null,null,null,null,null,null,null,null,null,null,null,null,null,null,null,null,null,null,null,null,null,null,null,null,null,null,null,null,null,null,null,null,null,null,null,null,null,null,null,null,null,null,null,null,null,null,null,null,null,null,null,null,null,null,null,null,null,null,null,null,null,null,null,null,null,"",null,"",null,null,null,null,null,0,null,0]
["GLAUCOMA",null,0,0,0,null,null,null,null,null,null,null,null,null,null,null,null,null,null,null,null,null,null,null,null,null,null,null,null,null,null,null,null,null,null,null,null,null,null,null,null,null,null,null,null,null,null,null,null,null,null,null,null,null,null,null,null,null,null,null,null,null,null,null,null,null,null,null,null,null,null,null,null,null,null,null,null,null,null,null,"",null,"",null,null,null,null,null,0,null,0]
["ENFERMEDAD DE PARKINSON ",null,0,0,0,null,null,null,null,null,null,null,null,null,null,null,null,null,null,null,null,null,null,null,null,null,null,null,null,null,null,null,null,null,null,null,null,null,null,null,null,null,null,null,null,null,null,null,null,null,null,null,null,null,null,null,null,null,null,null,null,null,null,null,null,null,null,null,null,null,null,null,null,null,null,null,null,null,null,null,"",null,"",null,null,null,null,null,0,null,0]
["ARTROSIS DE CADERA Y RODILLA ",null,0,0,0,null,null,null,null,null,null,null,null,null,null,null,null,null,null,null,null,null,null,null,null,null,null,null,null,null,null,null,null,null,null,null,null,null,null,null,null,null,null,null,null,null,null,null,null,null,null,null,null,null,null,null,null,null,null,null,null,null,null,null,null,null,null,null,null,null,null,null,null,null,null,null,null,null,null,null,"",null,"",null,null,null,null,null,0,null,0]
["ALIVIO DEL DOLOR",null,0,0,0,null,null,null,null,null,null,null,null,null,null,null,null,null,null,null,null,null,null,null,null,null,null,null,null,null,null,null,null,null,null,null,null,null,null,null,null,null,null,null,null,null,null,null,null,null,null,null,null,null,null,null,null,null,null,null,null,null,null,null,null,null,null,null,null,null,null,null,null,null,null,null,null,null,null,null,"",null,"",null,null,null,null,null,0,null,0]
["HIPOTIROIDISMO",null,0,0,0,null,null,null,null,null,null,null,null,null,null,null,null,null,null,null,null,null,null,null,null,null,null,null,null,null,null,null,null,null,null,null,null,null,null,null,null,null,null,null,null,null,null,null,null,null,null,null,null,null,null,null,null,null,null,null,null,null,null,null,null,null,null,null,null,null,null,null,null,null,null,null,null,null,null,null,"",null,"",null,null,null,null,null,0,null,0]
["DEPENDENCIA LEVE",null,0,0,0,null,null,null,null,null,null,null,null,null,null,null,null,null,null,null,null,null,null,null,null,null,null,null,null,null,null,null,null,null,null,null,null,null,null,null,null,null,null,null,null,null,null,null,null,null,null,null,null,null,null,null,null,null,null,null,null,null,null,null,null,null,null,null,null,null,null,null,null,null,null,null,null,null,null,null,"",null,"",null,null,null,null,null,0,null,0]
["DEPENDENCIA MODERADA",null,0,0,0,null,null,null,null,null,null,null,null,null,null,null,null,null,null,null,null,null,null,null,null,null,null,null,null,null,null,null,null,null,null,null,null,null,null,null,null,null,null,null,null,null,null,null,null,null,null,null,null,null,null,null,null,null,null,null,null,null,null,null,null,null,null,null,null,null,null,null,null,null,null,null,null,null,null,null,"",null,"",null,null,null,null,null,0,null,0]
["DEPENDENCIA SEVERA","ONCOLÓGICA",0,0,0,null,null,null,null,null,null,null,null,null,null,null,null,null,null,null,null,null,null,null,null,null,null,null,null,null,null,null,null,null,null,null,null,null,null,null,null,null,null,null,null,null,null,null,null,null,null,null,null,null,null,null,null,null,null,null,null,null,null,null,null,null,null,null,null,null,null,null,null,null,null,null,null,null,null,null,"",null,"",null,null,null,null,null,0,null,0]
[null,"NO ONCOLÓGICA",0,0,0,null,null,null,null,null,null,null,null,null,null,null,null,null,null,null,null,null,null,null,null,null,null,null,null,null,null,null,null,null,null,null,null,null,null,null,null,null,null,null,null,null,null,null,null,null,null,null,null,null,null,null,null,null,null,null,null,null,null,null,null,null,null,null,null,null,null,null,null,null,null,null,null,null,null,null,"",null,"",null,null,null,null,null,0,null,0]
[null,"CON ULCERAS POR PRESION",0,0,{"$f":"+G34+I34+K34+M34+O34+Q34+S34+U34+W34+Y34+AA34+AC34+AE34+AG34+AI34+AK34+AM34","v":0},null,null,null,null,null,null,null,null,null,null,null,null,null,null,null,null,null,null,null,null,null,null,null,null,null,null,null,null,null,null,null,null,null,null,null,null,null,null,null,null,null,null,null,null,null,null,null,null,null,null,null,null,null,null,null,null,null,null,null,null,null,null,null,null,null,null,null,null,null,null,null,null,null,null,null,"",{"$f":"IF($C34<=$C32+$C33,\"\",\"Dependencia severa con escaras no debe ser mayor que los Dependientes oncológicos más no Oncológicos. \")","v":""},"",null,null,null,null,null,0,{"$f":"IF($C34<=$C32+$C33,0,1)","v":0},0]
["ATENCIÓN DOMICILIARIA POR DEPENDENCIA SEVERA","TOTAL PERSONAS",{"$f":"SUM(D35:E35)","v":0},{"$f":"+F35+H35+J35+L35+N35+P35+R35+T35+V35+X35+Z35+AB35+AD35+AF35+AH35+AJ35+AL35","v":0},{"$f":"+G35+I35+K35+M35+O35+Q35+S35+U35+W35+Y35+AA35+AC35+AE35+AG35+AI35+AK35+AM35","v":0},null,null,null,null,null,null,null,null,null,null,null,null,null,null,null,null,null,null,null,null,null,null,null,null,null,null,null,null,null,null,null,null,null,null,null,null,null,null,null,null,null,null,null,null,null,null,null,null,null,null,null,null,null,null,null,null,null,null,null,null,null,null,null,null,null,null,null,null,null,null,null,null,null,null,null,"",{"$f":"IF($C35<=$C32+$C33,\"\",\"* Atención Domiciliaria por Dependencia Severa: Total Personas no debe ser mayor que los Dependientes oncológicos más no Oncológicos. \")","v":""},"",null,null,null,null,null,0,{"$f":"IF($C35<=$C32+$C33,0,1)","v":0},0]
[null,"ONCOLÓGICA",0,0,0,null,null,null,null,null,null,null,null,null,null,null,null,null,null,null,null,null,null,null,null,null,null,null,null,null,null,null,null,null,null,null,null,null,null,null,null,null,null,null,null,null,null,null,null,null,null,null,null,null,null,null,null,null,null,null,null,null,null,null,null,null,null,null,null,null,null,null,null,null,null,null,null,null,null,null,"",{"$f":"IF($C36<=$C35,\"\",\"* Atención Domiciliaria por Dependencia Severa: Total Personas con Escaras no debe ser mayor al Total Personas. \")","v":""},"",{"$f":"IF($C36<=$C34,\"\",\"* Atención Domiciliaria por Dependencia Severa: Total Personas con Escaras no debe ser mayor a las personas con Dependencia Severa con Escaras. \")","v":""},null,null,null,null,0,{"$f":"IF($C36<=$C35,0,1)","v":0},0,{"$f":"IF($C36<=$C34,0,1)","v":0}]
[null,"NO ONCOLÓGICA",{"$f":"SUM(D37:E37)","v":0},{"$f":"+F37+H37+J37+L37+N37+P37+R37+T37+V37+X37+Z37+AB37+AD37+AF37+AH37+AJ37+AL37","v":0},{"$f":"+G37+I37+K37+M37+O37+Q37+S37+U37+W37+Y37+AA37+AC37+AE37+AG37+AI37+AK37+AM37","v":0}]
[null,"CON DEMENCIA",0,0,0]
[null,"CON ULCERAS POR PRESION",0,0,0]
[null,"CON INDICACIÓN DE NUTRICIÓN ENTERAL DOMICILIARIA (NED) ",{"$f":"SUM(D40:E40)","v":0},{"$f":"+F40+H40+J40+L40+N40+P40+R40+T40+V40+X40+Z40+AB40+AD40+AF40+AH40+AJ40+AL40","v":0},{"$f":"+G40+I40+K40+M40+O40+Q40+S40+U40+W40+Y40+AA40+AC40+AE40+AG40+AI40+AK40+AM40","v":0},null,null,null,null,null,null,null,null,null,null,null,null,null,null,null,null,null,null,null,null,null,null,null,null,null,null,null,null,null,null,null,null,null,null,null,null,null,null,null,null,null,null,null,null,null,null,null,null,null,null,null,null,null,null,null,null,null,null,null,null,null,null,null,null,null,null,null,null,null,null,null,null,null,null,null,"",{"$f":"IF($C40<=$C35,\"\",\"Total Personas con indicación de Nutrición Enteral Domiciliaria no debe ser mayor al Total Personas. \")","v":""},"",null,null,null,null,null,{"$f":"IF($C40>=$AO40+$AP40,0,1)","v":0},{"$f":"IF($C40<=$C35,0,1)","v":0},0]
["(*) Incluidos en Dependencia Severa Oncológica y NO Oncológica"]
["SECCION B: CUIDADORES DE PACIENTES CON DEPENDENCIA SEVERA"]
["CONCEPTO","Total","Hombres","Mujeres","ATENCIÓN DOMICILIARIA POR DEPENDENCIA SEVERA"]
[null,null,null,null,"Total Cuidadoras/es capacitadas/os","Total cuidadoras/es con examen preventivo vigente","Cuidadoras/es sin examen preventivo, ingresado a programa de salud","Cuidadoras/es con apoyo monetario","Cuidadoras/es en espera de apoyo monetario","Total Cuidadoras/es con evaluacion anual de nivel de sobrecarga","Total Cuidadoras/es mayores de 65 años"]
["NÚMERO DE CUIDADORES",{"$f":"SUM(C45:D45)","v":0},null,null,null,null,null,null,null,null,null,null,null,null,null,null,null,null,null,null,null,null,null,null,null,null,null,null,null,null,null,null,null,null,null,null,null,null,null,null,null,null,null,null,null,null,null,null,null,null,null,null,null,null,null,null,null,null,null,null,null,null,null,null,null,null,null,null,null,null,null,null,null,null,null,null,null,null,null,null,null,null,null,{"$f":"IF($D45>=$H45,\"\",\"* Los Cuidadores con apoyo monetario no debe ser mayor al Total de Cuidadores. \")","v":""},{"$f":"IF($D45>=$E45,\"\",\"* Los Cuidadores Capacitados no debe ser mayor al Total Cuidadores. \")","v":""},{"$f":"IF($H$45=#REF!,\"\",\"* Los Cuidadores con apoyo monetario debe ser igual al Total de personas 'con cuidador que recibe apoyo monetario' de la sección A. \")","v":{"$error":"#REF!"}},{"$f":"IF(E45<#REF!,\"* El total de Cuidadores capacitados con apoyo monetario no puede ser mayor al Total de Cuidadores Capacitados\",\"\")","v":{"$error":"#REF!"}},{"$f":"IF(#REF!>H45,\"* El N° de cuidadores con apoyo monetario deben ser mayor o igual a los cuidadores capacitados con apoyo monetarios. \",\"\")","v":{"$error":"#REF!"}},null,null,null,{"$f":"IF($D45>=$H45,0,1)","v":0},{"$f":"IF($D45>=$E45,0,1)","v":0},{"$f":"IF($H$45=#REF!,0,1)","v":{"$error":"#REF!"}},{"$f":"IF(H45<#REF!,1,0)","v":{"$error":"#REF!"}},{"$f":"IF(#REF!>H45,1,0)","v":{"$error":"#REF!"}}]
["SECCION C: POBLACIÓN EN CONTROL EN PROGRAMA DE REHABILITACIÓN PULMONAR EN SALA IRA-ERA"]
["PROGRAMA",null,"TOTAL",null,null,"GRUPOS DE EDAD (en años) Y SEXO"]
[null,null,null,null,null,"0 a 4 años",null,"5 a 9 años",null,"10 a 14 años",null,"15 a 19 años",null,"20 a 24 años",null,"25 a 29 años",null,"30 a 34 años",null,"35 a 39 años",null,"40 a 44 años",null,"45 a 49 años",null,"50 a 54 años",null,"55 a 59 años",null,"60 a 64 años",null,"65 a 69 años",null,"70 a 74 años",null,"75 a 79 años",null,"80 y más años"]
[null,null,"Ambos\nsexos","Hombres","Mujeres","Hombres","Mujeres","Hombres","Mujeres","Hombres","Mujeres","Hombres","Mujeres","Hombres","Mujeres","Hombres","Mujeres","Hombres","Mujeres","Hombres","Mujeres","Hombres","Mujeres","Hombres","Mujeres","Hombres","Mujeres","Hombres","Mujeres","Hombres","Mujeres","Hombres ","Mujeres","Hombres ","Mujeres","Hombres ","Mujeres","Hombres ","Mujeres"]
["REHABILITACIÓN PULMONAR","Ingresos",{"$f":"SUM(D50:E50)","v":0},{"$f":"+F50+H50+J50+L50+N50+P50+R50+T50+V50+X50+Z50+AB50+AD50+AF50+AH50+AJ50+AL50","v":0},{"$f":"+G50+I50+K50+M50+O50+Q50+S50+U50+W50+Y50+AA50+AC50+AE50+AG50+AI50+AK50+AM50","v":0}]
[null,"Abandonos",{"$f":"SUM(D51:E51)","v":0},{"$f":"+F51+H51+J51+L51+N51+P51+R51+T51+V51+X51+Z51+AB51+AD51+AF51+AH51+AJ51+AL51","v":0},{"$f":"+G51+I51+K51+M51+O51+Q51+S51+U51+W51+Y51+AA51+AC51+AE51+AG51+AI51+AK51+AM51","v":0}]
[null,"Egresos por termino de ciclo",0,0,{"$f":"+G52+I52+K52+M52+O52+Q52+S52+U52+W52+Y52+AA52+AC52+AE52+AG52+AI52+AK52+AM52","v":0}]
[null,"Articulacion continuidad en intersector",0,0,{"$f":"+G53+I53+K53+M53+O53+Q53+S53+U53+W53+Y53+AA53+AC53+AE53+AG53+AI53+AK53+AM53","v":0}]
["SECCION D: NIVEL DE CONTROL DE POBLACION RESPIRATORIA CRONICA"]
["PROGRAMAS",null,"TOTAL",null,null,"GRUPOS DE EDAD (en años) Y SEXO"]
[null,null,null,null,null,"0 a 4 años",null,"5 a 9 años",null,"10 a 14 años",null,"15 a 19 años",null,"20 a 24 años",null,"25 a 29 años",null,"30 a 34 años",null,"35 a 39 años",null,"40 a 44 años",null,"45 a 49 años",null,"50 a 54 años",null,"55 a 59 años",null,"60 a 64 años",null,"65 a 69 años",null,"70 a 74 años",null,"75 a 79 años",null,"80 y más años"]
[null,null,"Ambos\nsexos","Hombres","Mujeres","Hombres","Mujeres","Hombres","Mujeres","Hombres","Mujeres","Hombres","Mujeres","Hombres","Mujeres","Hombres","Mujeres","Hombres","Mujeres","Hombres","Mujeres","Hombres","Mujeres","Hombres","Mujeres","Hombres","Mujeres","Hombres","Mujeres","Hombres","Mujeres","Hombres ","Mujeres","Hombres ","Mujeres","Hombres ","Mujeres","Hombres ","Mujeres"]
["ASMA BRONQUIAL","Controlado",{"$f":"+D58+E58","v":0},{"$f":"+F58+H58+J58+L58+N58+P58+R58++T58+V58+X58+Z58+AB58+AD58++AF58+AH58+AJ58+AL58","v":0},{"$f":"+G58+I58+K58+M58+O58+Q58+S58++U58+W58+Y58+AA58+AC58+AE58++AG58+AI58+AK58+AM58","v":0}]
[null,"Parcialmente Controlado",{"$f":"+D59+E59","v":0},{"$f":"+F59+H59+J59+L59+N59+P59+R59++T59+V59+X59+Z59+AB59+AD59++AF59+AH59+AJ59+AL59","v":0},{"$f":"+G59+I59+K59+M59+O59+Q59+S59++U59+W59+Y59+AA59+AC59+AE59++AG59+AI59+AK59+AM59","v":0}]
[null,"No Controlado",0,0,0]
[null,"No evaluada",0,0,0,null,null,null,null,null,null,null,null,null,null,null,null,null,null,null,null,null,null,null,null,null,null,null,null,null,null,null,null,null,null,null,null,null,null,{"$f":"CB61","v":""},null,null,null,null,null,null,null,null,null,null,null,null,null,null,null,null,null,null,null,null,null,null,null,null,null,null,null,null,null,null,null,null,null,null,null,null,null,null,null,{"$f":"IF(SUM(C15:C17)>=SUM(C58:C61),\"\",\"* El total de Asma Bronquial en ambos sexo no puede ser mayor al total de Asma Bronquial de ambos sexo de la Sección A. \")","v":""},null,null,null,null,null,null,null,{"$f":"IF(SUM(C15:C17)>=SUM(C58:C61),0,1)","v":0}]
["ENFERMEDAD PULMONAR OBSTRUCTIVA CRÓNICA (EPOC)","Logra Control Adecuado",0,{"$f":"+V62+X62+Z62+AB62+AD62+AF62+AH62+AJ62+AL62","v":0},{"$f":"+W62+Y62+AA62+AC62+AE62+AG62+AI62+AK62+AM62","v":0}]
[null,"No Logra Control Adecuado",0,{"$f":"+V63+X63+Z63+AB63+AD63+AF63+AH63+AJ63+AL63","v":0},{"$f":"+W63+Y63+AA63+AC63+AE63+AG63+AI63+AK63+AM63","v":0}]
[null,"No evaluada",0,0,0,null,null,null,null,null,null,null,null,null,null,null,null,null,null,null,null,null,null,null,null,null,null,null,null,null,null,null,null,null,null,null,null,null,null,{"$f":"CB64","v":""},null,null,null,null,null,null,null,null,null,null,null,null,null,null,null,null,null,null,null,null,null,null,null,null,null,null,null,null,null,null,null,null,null,null,null,null,null,null,null,{"$f":"IF(SUM(C62:C64)>SUM(C18:C19),\"* El total de EPOC en ambos sexos no puede ser superior al total de EPOC en ambos sexos de la sección A. \",\"\")","v":""},null,null,null,null,null,null,null,{"$f":"IF(SUM(C62:C64)>SUM(C18:C19),1,0)","v":0}]
["SECCIÓN E:  RESULTADO DE ENCUESTA CALIDAD DE VIDA"]
["DIAGNÓSTICO","ACTIVIDAD","TOTAL",null,null,"POR EDAD"]
[null,null,null,null,null,"0 a 4 años",null,"5 - 9 \naños",null,"10 - 14\naños",null,"15 - 19\naños",null,"20 a 24 años\n",null,"25 a 29 años",null,"30 a 34 años",null,"35 a 39 años",null,"40 - 44 años",null,"45 - 49 años",null,"50 - 54 años",null,"55 - 59 años",null,"60 - 64 años",null,"65 - 69 años",null,"70 - 74 años",null,"75 - 79 años",null,"80 y mas años"]
[null,null,"Ambos Sexos","Hombres","Mujeres","Hombres","Mujeres","Hombres","Mujeres","Hombres","Mujeres","Hombres","Mujeres","Hombres","Mujeres","Hombres","Mujeres","Hombres","Mujeres","Hombres","Mujeres","Hombres","Mujeres","Hombres","Mujeres","Hombres","Mujeres","Hombres","Mujeres","Hombres","Mujeres","Hombres","Mujeres","Hombres","Mujeres","Hombres","Mujeres","Hombres","Mujeres"]
["ENFERMEDAD PULMONAR OBSTRUCTIVA CRÓNICA (EPOC)","Evaluados",{"$f":"SUM(D69:E69)","v":0},{"$f":"+V69+X69+Z69+AB69+AD69+AF69+AH69+AJ69+AL69","v":0},{"$f":"+W69+Y69+AA69+AC69+AE69+AG69+AI69+AK69+AM69","v":0}]
[null,"Mejora en relación a  año anterior",{"$f":"SUM(D70:E70)","v":0},{"$f":"+V70+X70+Z70+AB70+AD70+AF70+AH70+AJ70+AL70","v":0},{"$f":"+W70+Y70+AA70+AC70+AE70+AG70+AI70+AK70+AM70","v":0}]
[null,"No mejora en relación a año anterior",{"$f":"SUM(D71:E71)","v":0},{"$f":"+V71+X71+Z71+AB71+AD71+AF71+AH71+AJ71+AL71","v":0},{"$f":"+W71+Y71+AA71+AC71+AE71+AG71+AI71+AK71+AM71","v":0}]
["ASMA BRONQUIAL","Evaluados",0,{"$f":"+F72+H72+J72+L72+N72+P72+R72+T72+V72+X72+Z72+AB72+AD72+AF72+AH72+AJ72+AL72","v":0},{"$f":"+G72+I72+K72+M72+O72+Q72+S72+U72+W72+Y72+AA72+AC72+AE72+AG72+AI72+AK72+AM72","v":0}]
[null,"Mejora en relación a  año anterior",0,{"$f":"+F73+H73+J73+L73+N73+P73+R73+T73+V73+X73+Z73+AB73+AD73+AF73+AH73+AJ73+AL73","v":0},{"$f":"+G73+I73+K73+M73+O73+Q73+S73+U73+W73+Y73+AA73+AC73+AE73+AG73+AI73+AK73+AM73","v":0}]
[null,"No mejora en relación a año anterior",0,0,0]
["OTRAS CRÓNICAS RESPIRATORIAS","Evaluados",0,{"$f":"+F75+H75+J75+L75+N75+P75+R75+T75+V75+X75+Z75+AB75+AD75+AF75+AH75+AJ75+AL75","v":0},{"$f":"+G75+I75+K75+M75+O75+Q75+S75+U75+W75+Y75+AA75+AC75+AE75+AG75+AI75+AK75+AM75","v":0}]
[null,"Mejora en relación a  año anterior",0,0,{"$f":"+G76+I76+K76+M76+O76+Q76+S76+U76+W76+Y76+AA76+AC76+AE76+AG76+AI76+AK76+AM76","v":0}]
[null,"No mejora en relación a año anterior",0,0,0]
[]
[]
[]
[]
[]
[]
[]
[]
[{"$f":"SUM(C12:AP36,D45:H45,C50:AM50,C58:AM64)","v":0},"datos"]
[{"$f":"SUM(CI11:CO77)","v":{"$error":"#REF!"}},"errores"]

{"sheet":"P4","index":4,"n_rows":100,"n_cols":123,"rows_kept":100,"cut":false,"hidden":false,"merged":[[12,0,14,0],[44,27,44,28],[8,35,9,36],[83,0,83,1],[67,0,67,1],[68,0,68,1],[51,0,51,1],[80,0,80,1],[54,0,54,1],[43,0,45,1],[77,0,77,1],[43,33,44,34],[53,0,53,1],[11,0,11,1],[9,25,9,26],[8,33,9,34],[47,0,47,1],[31,31,31,32],[31,25,31,26],[31,29,31,30],[31,11,31,12],[31,7,31,8],[43,2,44,4],[43,5,43,32],[79,0,79,1],[82,0,82,1],[76,0,76,1],[63,0,65,0],[57,0,57,1],[74,0,74,1],[31,9,31,10],[75,0,75,1],[81,0,81,1],[44,5,44,6],[44,7,44,8],[44,9,44,10],[78,0,78,1],[66,0,66,1],[46,2,46,36],[73,2,73,36],[79,2,79,36],[59,0,62,0],[15,0,20,0],[50,0,50,1],[30,2,31,4],[31,5,31,6],[52,0,52,1],[39,0,41,0],[48,0,48,1],[33,0,34,0],[49,0,49,1],[21,0,28,0],[29,0,29,1],[30,0,32,1],[35,0,37,0],[30,5,30,32],[31,27,31,28],[31,17,31,18],[31,19,31,20],[44,11,44,12],[44,13,44,14],[44,15,44,16],[44,17,44,18],[44,29,44,30],[8,62,9,62],[8,57,9,58],[8,59,10,59],[8,61,9,61],[8,55,9,56],[8,37,10,37],[43,35,44,36],[6,0,6,20],[8,0,10,1],[8,2,9,4],[9,15,9,16],[9,17,9,18],[9,19,9,20],[9,9,9,10],[9,11,9,12],[9,13,9,14],[8,5,8,32],[9,5,9,6],[9,7,9,8],[9,27,9,28],[9,21,9,22],[9,29,9,30],[9,31,9,32],[9,23,9,24],[43,99,44,99],[43,100,44,100],[43,55,44,56],[43,57,44,58],[43,91,44,92],[44,31,44,32],[69,0,69,1],[30,33,31,34],[30,35,31,36],[31,13,31,14],[31,15,31,16],[43,93,44,94],[43,61,44,61],[43,62,44,62],[31,21,31,22],[31,23,31,24],[44,23,44,24],[44,25,44,26],[44,19,44,20],[44,21,44,22],[55,0,55,1]]}
["DATOS DEL ESTABLECIMIENTO"]
[{"$f":"CONCATENATE(\"COMUNA: \",NOMBRE!$B$2,\" - \",\"( \",NOMBRE!$C$2,NOMBRE!$D$2,NOMBRE!$E$2,NOMBRE!$F$2,NOMBRE!$G$2,\" )\")","v":"COMUNA:  - (  )"}]
[{"$f":"CONCATENATE(\"ESTABLECIMIENTO/ESTRATEGIA: \",NOMBRE!$B$3,\" - \",\"( \",NOMBRE!$C$3,NOMBRE!$D$3,NOMBRE!$E$3,NOMBRE!$F$3,NOMBRE!$G$3,NOMBRE!$H$3,\" )\")","v":"ESTABLECIMIENTO/ESTRATEGIA:  - (  )"}]
[{"$f":"CONCATENATE(\"MES: \",NOMBRE!$B$6,\" - \",\"( \",NOMBRE!$C$6,NOMBRE!$D$6,\" )\")","v":"MES:  - (  )"}]
[{"$f":"CONCATENATE(\"AÑO: \",NOMBRE!$B$7)","v":"AÑO: 2023"}]
[]
["REM-P4. POBLACIÓN EN CONTROL PROGRAMA DE SALUD CARDIOVASCULAR (PSCV)"]
["SECCIÓN A: PROGRAMA SALUD CARDIOVASCULAR (PSCV)"]
["CONCEPTO",null,"TOTAL ",null,null,"GRUPOS DE EDAD (en años) Y SEXO",null,null,null,null,null,null,null,null,null,null,null,null,null,null,null,null,null,null,null,null,null,null,null,null,null,null,null,"Pueblos Originarios",null,"Población Migrantes",null,"Pacientes Diabéticos",null,null,null,null,null,null,null,null,null,null,null,null,null,null,null,null,null,"Pueblos Originarios",null,"Población Migrantes",null,"Pacientes Diabéticos",null,"Pueblos Originarios","Población Migrantes"]
[null,null,null,null,null,"15 a 19 años",null,"20 a 24 años",null,"25 a 29 años",null,"30 a 34 años",null,"35 a 39 años",null,"40 a 44 años",null,"45 a 49 años",null,"50 a 54 años",null,"55 a 59 años",null,"60 a 64 años",null,"65 a 69 años",null,"70 a 74 años",null,"75 a 79 años",null,"80 y más años"]
[null,null,"Ambos sexos","Hombres","Mujeres","Hombres","Mujeres","Hombres","Mujeres","Hombres","Mujeres","Hombres","Mujeres","Hombres","Mujeres","Hombres","Mujeres","Hombres","Mujeres","Hombres","Mujeres","Hombres","Mujeres","Hombres","Mujeres","Hombres ","Mujeres","Hombres ","Mujeres","Hombres ","Mujeres","Hombres ","Mujeres","Hombres","Mujeres","Hombres","Mujeres",null,null,null,null,null,null,null,null,null,null,null,null,null,null,null,null,null,null,"Hombres","Mujeres","Hombres","Mujeres",null,null,"No Olvide","No Olvide"]
["NUMERO DE PERSONAS EN PSCV",null,{"$f":"SUM(D12:E12)","v":0},{"$f":"+F12+H12+J12+L12+N12+P12+R12+T12+V12+X12+Z12+AB12+AD12+AF12","v":0},{"$f":"+G12+I12+K12+M12+O12+Q12+S12+U12+W12+Y12+AA12+AC12+AE12+AG12","v":0},{"$f":"SUM(F13:F15)","v":0},{"$f":"SUM(G13:G15)","v":0},0,0,0,0,0,0,0,0,0,0,0,0,0,0,0,0,0,0,0,0,0,0,0,0,0,0,{"$f":"SUM(AH13:AH15)","v":0},{"$f":"SUM(AI13:AI15)","v":0},0,{"$f":"SUM(AK13:AK15)","v":0}]
["CLASIFICACIÓN DEL\nRIESGO\nCARDIOVASCULAR","BAJO",{"$f":"SUM(D13:E13)","v":0},{"$f":"+F13+H13+J13+L13+N13+P13+R13+T13+V13+X13+Z13+AB13+AD13+AF13","v":0},{"$f":"+G13+I13+K13+M13+O13+Q13+S13+U13+W13+Y13+AA13+AC13+AE13+AG13","v":0},null,null,null,null,null,null,null,null,null,null,null,null,null,null,null,null,null,null,null,null,null,null,null,null,null,null,null,null,null,null,null,null,null,{"$f":" BD13 & BE13 & BF13 & BG13 & BH13 & BJ13 & BK13","v":""},null,null,null,null,null,null,null,null,null,null,null,null,null,null,null,null,{"$f":"IF($D13>=$AH13,\"\",\"* Pueblos Originarios-Hombres no debe ser mayor al Total de personas en PSCV. \")","v":""},{"$f":"IF($E13>=$AI13,\"\",\"* Pueblos Originarios-Mujeres no debe ser mayor al Total de personas en PSCV. \")","v":""},{"$f":"IF($D13>=$AJ13,\"\",\"* Población Migrantes-Hombres no debe ser mayor al Total de personas en PSCV. \")","v":""},{"$f":"IF($E13>=$AK13,\"\",\"* Población Migrantes-Mujeres no debe ser mayor al Total de personas en PSCV. \")","v":""},{"$f":"IF(C12<>C29, \"* El numero de Personas en PSCV de ambos sexo debe ser igua al total de detección y prevención de la progresión de la enfermedad renal crónica de ambos sexo. \",\"\")","v":""},null,{"$f":"IF(AND(D13<>0,AH13=\"\"),\"* No olvide escribir en la celda de 'Pueblos Originarios' (Digite CERO si no tiene). \",IF(AND(E13<>0,AI13=\"\"),\"* No olvide escribir en la celda de 'Pueblos Originarios' (Digite CERO si no tiene). \",\"\"))","v":""},{"$f":"IF(AND(D13<>0,AJ13=\"\"),\"* No olvide escribir en la celda de 'Población Migrantes' (Digite CERO si no tiene). \",IF(AND(E13<>0,AK13=\"\"),\"* No olvide escribir en la celda de 'Población Migrantes' (Digite CERO si no tiene). \",\"\"))","v":""},null,null,null,null,null,null,null,null,null,null,null,null,null,null,null,null,null,null,null,null,null,null,null,null,null,null,null,null,{"$f":"IF($D13>=$AH13,0,1)","v":0},{"$f":"IF($E13>=$AI13,0,1)","v":0},{"$f":"IF($D13>=$AJ13,0,1)","v":0},{"$f":"IF($E13>=$AK13,0,1)","v":0},{"$f":"IF(C12<>C29, 1,0)","v":0},null,null,null,{"$f":"IF(AND(D15<>0,AH15=\"\"),1,IF(AND(E15<>0,AI15=\"\"),1,0))","v":0},{"$f":"IF(AND(D15<>0,AJ15=\"\"),1,IF(AND(E15<>0,AK15=\"\"),1,0))","v":0}]
[null,"MODERADO",0,{"$f":"+F14+H14+J14+L14+N14+P14+R14+T14+V14+X14+Z14+AB14+AD14+AF14","v":0},0,null,null,null,null,null,null,null,null,null,null,null,null,null,null,null,null,null,null,null,null,null,null,null,null,null,null,null,null,null,null,null,null,null,{"$f":" BD14 & BE14 & BF14 & BG14 & BJ14 & BK14","v":""},null,null,null,null,null,null,null,null,null,null,null,null,null,null,null,null,"","","","",null,null,"","",null,null,null,null,null,null,null,null,null,null,null,null,null,null,null,null,null,null,null,null,null,null,null,null,null,null,null,null,{"$f":"IF($D14>=$AH14,0,1)","v":0},{"$f":"IF($E14>=$AI14,0,1)","v":0},{"$f":"IF($D14>=$AJ14,0,1)","v":0},{"$f":"IF($E14>=$AK14,0,1)","v":0},null,null,null,null,{"$f":"IF(AND(D16<>0,AH16=\"\"),1,IF(AND(E16<>0,AI16=\"\"),1,0))","v":0},{"$f":"IF(AND(D16<>0,AJ16=\"\"),1,IF(AND(E16<>0,AK16=\"\"),1,0))","v":0}]
[null,"ALTO",0,0,0,null,null,null,null,null,null,null,null,null,null,null,null,null,null,null,null,null,null,null,null,null,null,null,null,null,null,null,null,null,null,null,null,null,"",null,null,null,null,null,null,null,null,null,null,null,null,null,null,null,null,"","","","",null,null,"","",null,null,null,null,null,null,null,null,null,null,null,null,null,null,null,null,null,null,null,null,null,null,null,null,null,null,null,null,0,0,0,0,null,null,null,null,0,0]
["PERSONAS BAJO CONTROL SEGÚN PATOLOGÍA Y FACTORES DE RIESGO (EXISTENCIA)","HIPERTENSIÓN ARTERIAL",0,0,0,null,null,null,null,null,null,null,null,null,null,null,null,null,null,null,null,null,null,null,null,null,null,null,null,null,null,null,null,null,null,null,null,null,"",null,null,null,null,null,null,null,null,null,null,null,null,null,null,null,null,"","","","",null,null,"","",null,null,null,null,null,null,null,null,null,null,null,null,null,null,null,null,null,null,null,null,null,null,null,null,null,null,null,null,0,0,0,0,null,null,null,null,0,0]
[null,"DIABETES MELLITUS TIPO 2",0,{"$f":"+F17+H17+J17+L17+N17+P17+R17+T17+V17+X17+Z17+AB17+AD17+AF17","v":0},0,null,null,null,null,null,null,null,null,null,null,null,null,null,null,null,null,null,null,null,null,null,null,null,null,null,null,null,null,null,null,null,null,null,"",null,null,null,null,null,null,null,null,null,null,null,null,null,null,null,null,"","","","",null,null,"","",null,null,null,null,null,null,null,null,null,null,null,null,null,null,null,null,null,null,null,null,null,null,null,null,null,null,null,null,0,0,0,0,null,null,null,null,0,0]
[null,"DISLIPIDEMIA",0,0,0,null,null,null,null,null,null,null,null,null,null,null,null,null,null,null,null,null,null,null,null,null,null,null,null,null,null,null,null,null,null,null,null,null,"",null,null,null,null,null,null,null,null,null,null,null,null,null,null,null,null,"","","","",null,null,"","",null,null,null,null,null,null,null,null,null,null,null,null,null,null,null,null,null,null,null,null,null,null,null,null,null,null,null,null,0,0,0,0,null,null,null,null,0,0]
[null,"TABAQUISMO ≥ 55 AÑOS",0,{"$f":"+V19+X19+Z19+AB19+AD19+AF19","v":0},{"$f":"+W19+Y19+AA19+AC19+AE19+AG19","v":0},null,null,null,null,null,null,null,null,null,null,null,null,null,null,null,null,null,null,null,null,null,null,null,null,null,null,null,null,null,null,null,null,null,"",null,null,null,null,null,null,null,null,null,null,null,null,null,null,null,null,"","","","",null,null,"","",null,null,null,null,null,null,null,null,null,null,null,null,null,null,null,null,null,null,null,null,null,null,null,null,null,null,null,null,0,0,0,0,null,null,null,null,0,0]
[null,"ANTECEDENTES DE INFARTO AGUDO AL MIOCARDIO (IAM)",0,{"$f":"+F20+H20+J20+L20+N20+P20+R20+T20+V20+X20+Z20+AB20+AD20+AF20","v":0},0,null,null,null,null,null,null,null,null,null,null,null,null,null,null,null,null,null,null,null,null,null,null,null,null,null,null,null,null,null,null,null,null,null,"",null,null,null,null,null,null,null,null,null,null,null,null,null,null,null,null,"","","","",null,null,"","",null,null,null,null,null,null,null,null,null,null,null,null,null,null,null,null,null,null,null,null,null,null,null,null,null,null,null,null,0,0,0,0,null,null,null,null,0,0]
[null,"ANTECEDENTES DE ENFERMEDAD CEREBRO VASCULAR ",0,{"$f":"+F21+H21+J21+L21+N21+P21+R21+T21+V21+X21+Z21+AB21+AD21+AF21","v":0},0,null,null,null,null,null,null,null,null,null,null,null,null,null,null,null,null,null,null,null,null,null,null,null,null,null,null,null,null,null,null,null,null,null,"",null,null,null,null,null,null,null,null,null,null,null,null,null,null,null,null,"","","","",null,null,"","",null,null,null,null,null,null,null,null,null,null,null,null,null,null,null,null,null,null,null,null,null,null,null,null,null,null,null,null,0,0,0,0,null,null,null,null,0,0]
["DETECCIÓN Y PREVENCION DE LA PROGRESION DE LA ENFERMEDAD RENAL CRÓNICA (ERC)","SIN ENFERMEDAD RENAL (S/ERC)",{"$f":"SUM(D22:E22)","v":0},{"$f":"+F22+H22+J22+L22+N22+P22+R22+T22+V22+X22+Z22+AB22+AD22+AF22","v":0},0,null,null,null,null,null,null,null,null,null,null,null,null,null,null,null,null,null,null,null,null,null,null,null,null,null,null,null,null,null,null,null,null,null,{"$f":" BD22 & BE22 & BH22 & BF22 & BG22 & BJ22 & BK22","v":""},null,null,null,null,null,null,null,null,null,null,null,null,null,null,null,null,"","","","",{"$f":"IF($AL22<=$C22,\"\",\"* Personas diabéticas 'Sin enfermedad renal' no debe ser mayor que el Total pacientes evaluados. \")","v":""},null,"","",null,null,null,null,null,null,null,null,null,null,null,null,null,null,null,null,null,null,null,null,null,null,null,null,null,null,null,null,0,0,0,0,{"$f":"IF($AL22<=$C22,0,1)","v":0},null,null,null,{"$f":"IF(AND(D25<>0,AH25=\"\"),1,IF(AND(E25<>0,AI25=\"\"),1,0))","v":0},{"$f":"IF(AND(D25<>0,AJ25=\"\"),1,IF(AND(E25<>0,AK25=\"\"),1,0))","v":0}]
[null,"ETAPA G1 ",{"$f":"SUM(D23:E23)","v":0},0,0,null,null,null,null,null,null,null,null,null,null,null,null,null,null,null,null,null,null,null,null,null,null,null,null,null,null,null,null,null,null,null,null,null,"",null,null,null,null,null,null,null,null,null,null,null,null,null,null,null,null,"","","","",{"$f":"IF($AL23<=$C23,\"\",\"* Personas diabéticas 'Etapa 1 y 2' no debe ser mayor que el Total pacientes evaluados. \")","v":""},null,"","",null,null,null,null,null,null,null,null,null,null,null,null,null,null,null,null,null,null,null,null,null,null,null,null,null,null,null,null,0,0,0,0,0,null,null,null,{"$f":"IF(AND(D26<>0,AH26=\"\"),1,IF(AND(E26<>0,AI26=\"\"),1,0))","v":0},{"$f":"IF(AND(D26<>0,AJ26=\"\"),1,IF(AND(E26<>0,AK26=\"\"),1,0))","v":0}]
[null,"ETAPA G2 ",{"$f":"SUM(D24:E24)","v":0},0,0]
[null,"ETAPA G3a",0,0,0,null,null,null,null,null,null,null,null,null,null,null,null,null,null,null,null,null,null,null,null,null,null,null,null,null,null,null,null,null,null,null,null,null,"",null,null,null,null,null,null,null,null,null,null,null,null,null,null,null,null,"","","","",{"$f":"IF($AL25<=$C25,\"\",\"* Personas diabéticas 'Etapa 1 y 2' no debe ser mayor que el Total pacientes evaluados. \")","v":""},null,"","",null,null,null,null,null,null,null,null,null,null,null,null,null,null,null,null,null,null,null,null,null,null,null,null,null,null,null,null,0,0,0,0,0,null,null,null,0,0]
[null,"ETAPA G3b ",0,0,0,null,null,null,null,null,null,null,null,null,null,null,null,null,null,null,null,null,null,null,null,null,null,null,null,null,null,null,null,null,null,null,null,null,"",null,null,null,null,null,null,null,null,null,null,null,null,null,null,null,null,"","","","",{"$f":"IF($AL26<=$C26,\"\",\"* Personas diabéticas 'Etapa 1 y 2' no debe ser mayor que el Total pacientes evaluados. \")","v":""},null,"","",null,null,null,null,null,null,null,null,null,null,null,null,null,null,null,null,null,null,null,null,null,null,null,null,null,null,null,null,0,0,0,0,0,null,null,null,0,0]
[null,"ETAPA G4  ",0,0,0,null,null,null,null,null,null,null,null,null,null,null,null,null,null,null,null,null,null,null,null,null,null,null,null,null,null,null,null,null,null,null,null,null,"",null,null,null,null,null,null,null,null,null,null,null,null,null,null,null,null,"","","","",{"$f":"IF($AL27<=$C27,\"\",\"* Personas diabéticas 'Etapa 4' no debe ser mayor que el Total pacientes evaluados. \")","v":""},null,"","",null,null,null,null,null,null,null,null,null,null,null,null,null,null,null,null,null,null,null,null,null,null,null,null,null,null,null,null,0,0,0,0,0,null,null,null,0,0]
[null,"ETAPA G5",0,0,0,null,null,null,null,null,null,null,null,null,null,null,null,null,null,null,null,null,null,null,null,null,null,null,null,null,null,null,null,null,null,null,null,null,"",null,null,null,null,null,null,null,null,null,null,null,null,null,null,null,null,"","","","",{"$f":"IF($AL28<=$C28,\"\",\"* Personas diabéticas 'Etapa 5' no debe ser mayor que el Total pacientes evaluados. \")","v":""},null,"","",null,null,null,null,null,null,null,null,null,null,null,null,null,null,null,null,null,null,null,null,null,null,null,null,null,null,null,null,0,0,0,0,0,null,null,null,0,0]
[null,"TOTAL",{"$f":"SUM(D29:E29)","v":0},{"$f":"+F29+H29+J29+L29+N29+P29+R29+T29+V29+X29+Z29+AB29+AD29+AF29","v":0},{"$f":"+G29+I29+K29+M29+O29+Q29+S29+U29+W29+Y29+AA29+AC29+AE29+AG29","v":0},{"$f":"SUM(F22:F28)","v":0},{"$f":"SUM(G22:G28)","v":0},0,0,0,0,0,0,0,0,0,0,0,0,0,0,0,0,0,0,0,0,0,0,0,0,0,0,0,0,0,0,{"$f":"SUM(AL22:AL28)","v":0}]
["SECCIÓN B: METAS DE COMPENSACIÓN"]
["CONCEPTO",null,"TOTAL ",null,null,"GRUPOS DE EDAD (en años) Y SEXO",null,null,null,null,null,null,null,null,null,null,null,null,null,null,null,null,null,null,null,null,null,null,null,null,null,null,null,"Pueblos Originarios",null,"Población Migrantes"]
[null,null,null,null,null,"15 a 19 años",null,"20 a 24 años",null,"25 a 29 años",null,"30 a 34 años",null,"35 a 39 años",null,"40 a 44 años",null,"45 a 49 años",null,"50 a 54 años",null,"55 a 59 años",null,"60 a 64 años",null,"65 a 69 años",null,"70 a 74 años",null,"75 a 79 años",null,"80 y más años"]
[null,null,"Ambos sexos","Hombres","Mujeres","Hombres","Mujeres","Hombres","Mujeres","Hombres","Mujeres","Hombres","Mujeres","Hombres","Mujeres","Hombres","Mujeres","Hombres","Mujeres","Hombres","Mujeres","Hombres","Mujeres","Hombres","Mujeres","Hombres ","Mujeres","Hombres ","Mujeres","Hombres ","Mujeres","Hombres ","Mujeres","Hombres","Mujeres","Hombres","Mujeres"]
["PERSONAS BAJO CONTROL POR HIPERTENSION","PA < 140/90 mmHg ",{"$f":"SUM(D34:E34)","v":0},{"$f":"+F34+H34+J34+L34+N34+P34+R34+T34+V34+X34+Z34+AB34+AD34","v":0},{"$f":"+G34+I34+K34+M34+O34+Q34+S34+U34+W34+Y34+AA34+AC34+AE34","v":0},null,null,null,null,null,null,null,null,null,null,null,null,null,null,null,null,null,null,null,null,null,null,null,null,null,null,null,null,null,null,null,null,{"$f":" BD34 & BE34 & BH34 & BI34 & BJ34 & BK34 & BL34 & BM34 & BN34 & BO34 & BP34 & BQ34 & BR34 & BS34 & BT34 & BU34 & BV34 & BW34 & BX34 & BY34 & BZ34 & CA34 & CB34 & CC34 & CD34 & CE34 & CF34 & CH34 & CI34 & CG34 & BF34 & BG34 & BB34 & BC34","v":""},null,null,null,null,null,null,null,null,null,null,null,null,null,null,null,{"$f":"IF(AND(D34<>0,AH34=\"\"),\"* No olvide escribir en la celda de 'Pueblos Originarios' (Digite CERO si no tiene). \",IF(AND(E34<>0,AI34=\"\"),\"* No olvide escribir en la celda de 'Pueblos Originarios' (Digite CERO si no tiene). \",\"\"))","v":""},{"$f":"IF(AND(D34<>0,AJ34=\"\"),\"* No olvide escribir en la celda de 'Población Migrantes' (Digite CERO si no tiene). \",IF(AND(E34<>0,AK34=\"\"),\"* No olvide escribir en la celda de 'Población Migrantes' (Digite CERO si no tiene). \",\"\"))","v":""},{"$f":"IF($D$34>=$AH$34,\"\",\"* Pueblos Originarios-Hombres no debe ser mayor al Total de personas Hombres. \")","v":""},{"$f":"IF($E$34>=$AI$34,\"\",\"* Pueblos Originarios-Mujeres no debe ser mayor al Total de personas Mujeres. \")","v":""},{"$f":"IF($D34>=$AJ34,\"\",\"* Población Migrantes-Hombres no debe ser mayor al Total de personas Hombres. \")","v":""},{"$f":"IF($E34>=$AK34,\"\",\"* Pueblos Originarios-Mujeres no debe ser mayor al Total de personas Mujeres. \")","v":""},{"$f":"IF($F$34<=$F$16,\"\",\"* Pacientes 15 a 19 años (Hombres) con PA<140/90 mmHg debe ser menor o igual a Hipertensos en Sección A. \")","v":""},{"$f":"IF($G$34<=$G$16,\"\",\"* Pacientes 15 a 19 años (Mujeres) con PA<140/90 mmHg debe ser menor o igual a Hipertensos en Sección A. \")","v":""},{"$f":"IF($H$34<=$H$16,\"\",\"* Pacientes 20 a 24 años (Hombres) con PA<140/90 mmHg debe ser menor o igual a Hipertensos en Sección A. \")","v":""},{"$f":"IF($I$34<=$I$16,\"\",\"* Pacientes 20 a 24 años (Mujeres) con PA<140/90 mmHg debe ser menor o igual a Hipertensos en Sección A. \")","v":""},{"$f":"IF($J$34<=$J$16,\"\",\"* Pacientes 25 a 29 años (Hombres) con PA<140/90 mmHg debe ser menor o igual a Hipertensos en Sección A. \")","v":""},{"$f":"IF($K$34<=$K$16,\"\",\"* Pacientes 25 a 29 años (Mujeres) con PA<140/90 mmHg debe ser menor o igual a Hipertensos en Sección A. \")","v":""},{"$f":"IF($L$34<=$L$16,\"\",\"* Pacientes 30 a 34 años (Hombres) con PA<140/90 mmHg debe ser menor o igual a Hipertensos en Sección A. \")","v":""},{"$f":"IF($M$34<=$M$16,\"\",\"* Pacientes 30 a 34 años (Mujeres) con PA<140/90 mmHg debe ser menor o igual a Hipertensos en Sección A. \")","v":""},{"$f":"IF($N$34<=$N$16,\"\",\"* Pacientes 35 a 39 años (Hombres) con PA<140/90 mmHg debe ser menor o igual a Hipertensos en Sección A. \")","v":""},{"$f":"IF($O$34<=$O$16,\"\",\"* Pacientes 35 a 39 años (Mujeres) con PA<140/90 mmHg debe ser menor o igual a Hipertensos en Sección A. \")","v":""},{"$f":"IF($P$34<=$P$16,\"\",\"* Pacientes 40 a 44 años (Hombres) con PA<140/90 mmHg debe ser menor o igual a Hipertensos en Sección A. \")","v":""},{"$f":"IF($Q$34<=$Q$16,\"\",\"* Pacientes 40 a 44 años (Mujeres) con PA<140/90 mmHg debe ser menor o igual a Hipertensos en Sección A. \")","v":""},{"$f":"IF($R$34<=$R$16,\"\",\"* Pacientes 45 a 49 años (Hombres) con PA<140/90 mmHg debe ser menor o igual a Hipertensos en Sección A. \")","v":""},{"$f":"IF($S$34<=$S$16,\"\",\"* Pacientes 45 a 49 años (Mujeres) con PA<140/90 mmHg debe ser menor o igual a Hipertensos en Sección A. \")","v":""},{"$f":"IF($T$34<=$T$16,\"\",\"* Pacientes 50 a 54 años (Hombres) con PA<140/90 mmHg debe ser menor o igual a Hipertensos en Sección A. \")","v":""},{"$f":"IF($U$34<=$U$16,\"\",\"* Pacientes 50 a 54 años (Mujeres) con PA<140/90 mmHg debe ser menor o igual a Hipertensos en Sección A. \")","v":""},{"$f":"IF($V$34<=$V$16,\"\",\"* Pacientes 55 a 59 años (Hombres) con PA<140/90 mmHg debe ser menor o igual a Hipertensos en Sección A. \")","v":""},{"$f":"IF($W$34<=$W$16,\"\",\"* Pacientes 55 a 59 años (Mujeres) con PA<140/90 mmHg debe ser menor o igual a Hipertensos en Sección A. \")","v":""},{"$f":"IF($X$34<=$X$16,\"\",\"* Pacientes 60 a 64 años (Hombres) con PA<140/90 mmHg debe ser menor o igual a Hipertensos en Sección A. \")","v":""},{"$f":"IF($Y$34<=$Y$16,\"\",\"* Pacientes 60 a 64 años (Mujeres) con PA<140/90 mmHg debe ser menor o igual a Hipertensos en Sección A. \")","v":""},{"$f":"IF($Z$34<=$Z$16,\"\",\"* Pacientes 65 a 69 años (Hombres) con PA<140/90 mmHg debe ser menor o igual a Hipertensos en Sección A. \")","v":""},{"$f":"IF($AA$34<=$AA$16,\"\",\"* Pacientes 65 a 69 años (Mujeres) con PA<140/90 mmHg debe ser menor o igual a Hipertensos en Sección A. \")","v":""},{"$f":"IF($AB$34<=$AB$16,\"\",\"* Pacientes 70 a 74 años (Hombres) con PA<140/90 mmHg debe ser menor o igual a Hipertensos en Sección A. \")","v":""},{"$f":"IF($AC$34<=$AC$16,\"\",\"* Pacientes 70 a 74 años (Mujeres) con PA<140/90 mmHg debe ser menor o igual a Hipertensos en Sección A. \")","v":""},{"$f":"IF($AD$34<=$AD$16,\"\",\"* Pacientes 75 a 79 años (Hombres) con PA<140/90 mmHg debe ser menor o igual a Hipertensos en Sección A. \")","v":""},{"$f":"IF($AE$34<=$AE$16,\"\",\"* Pacientes 75 a 79 años (Mujeres) con PA<140/90 mmHg debe ser menor o igual a Hipertensos en Sección A. \")","v":""},{"$f":"IF($AF$34<=$AF$16,\"\",\"* Pacientes 80 y más años (Hombres) con PA<140/90 mmHg debe ser menor o igual a Hipertensos en Sección A. \")","v":""},{"$f":"IF($AG$34<=$AG$16,\"\",\"* Pacientes 80 y más años (Mujeres) con PA<140/90 mmHg debe ser menor o igual a Hipertensos en Sección A. \")","v":""},null,null,{"$f":"IF(AND(D34<>0,AH34=\"\"),1,IF(AND(E34<>0,AI34=\"\"),1,0))","v":0},{"$f":"IF(AND(D34<>0,AJ34=\"\"),1,IF(AND(E34<>0,AK34=\"\"),1,0))","v":0},{"$f":"IF($D$34>=$AH$34,0,1)","v":0},{"$f":"IF($E$34>=$AI$34,0,1)","v":0},{"$f":"IF($D34>=$AJ34,0,1)","v":0},{"$f":"IF($E34>=$AK34,0,1)","v":0},{"$f":"IF(F$34<=F$16,0,1)","v":0},0,0,0,0,0,0,0,0,0,0,0,0,0,0,0,0,0,0,0,0,0,0,0,0,0,0,0]
[null,"PA < 150/90 mmHg ",0,{"$f":"+AF35","v":0},{"$f":"+AG35","v":0},null,null,null,null,null,null,null,null,null,null,null,null,null,null,null,null,null,null,null,null,null,null,null,null,null,null,null,null,null,null,null,null,{"$f":" BD35 & BE35 & BF35 & BG35 & BB35 & BC35","v":""},null,null,null,null,null,null,null,null,null,null,null,null,null,null,null,"","",{"$f":"IF($D$35>=$AH$35,\"\",\"* Pueblos Originarios-Hombres no debe ser mayor al Total de personas Hombres. \")","v":""},{"$f":"IF($E$35>=$AI$35,\"\",\"* Pueblos Originarios-Mujeres no debe ser mayor al Total de personas Mujeres. \")","v":""},"","",null,null,null,null,null,null,null,null,null,null,null,null,null,null,null,null,null,null,null,null,null,null,null,null,null,null,null,null,null,null,{"$f":"IF(AND(D35<>0,AH35=\"\"),1,IF(AND(E35<>0,AI35=\"\"),1,0))","v":0},{"$f":"IF(AND(D35<>0,AJ35=\"\"),1,IF(AND(E35<>0,AK35=\"\"),1,0))","v":0},{"$f":"IF($D$35>=$AH$35,0,1)","v":0},{"$f":"IF($E$35>=$AI$35,0,1)","v":0},0,{"$f":"IF($E35>=$AK35,0,1)","v":0}]
["PERSONAS BAJO CONTROL POR DIABETES MELLITUS","HbA1C<7% ",0,{"$f":"+F36+H36+J36+L36+N36+P36+R36+T36+V36+X36+Z36+AB36+AD36","v":0},{"$f":"+G36+I36+K36+M36+O36+Q36+S36+U36+W36+Y36+AA36+AC36+AE36","v":0},null,null,null,null,null,null,null,null,null,null,null,null,null,null,null,null,null,null,null,null,null,null,null,null,null,null,null,null,null,null,null,null,{"$f":" BD36 & BE36 & BH36 & BI36 & BJ36 & BK36 & BL36 & BM36 & BN36 & BO36 & BP36 & BQ36 & BR36 & BS36 & BT36 & BU36 & BV36 & BW36 & BX36 & BY36 & BZ36 & CA36 & CB36 & CC36 & CD36 & CE36 & CF36 & CH36 & CI36 & CG36 & BF36 & BG36 & BB36 & BC36","v":""},null,null,null,null,null,null,null,null,null,null,null,null,null,null,null,"","",{"$f":"IF($D$36>=$AH$36,\"\",\"* Pueblos Originarios-Hombres no debe ser mayor al Total de personas Hombres. \")","v":""},{"$f":"IF($E$36>=$AI$36,\"\",\"* Pueblos Originarios-Mujeres no debe ser mayor al Total de personas Mujeres. \")","v":""},"","",{"$f":"IF($F$36<=$F$17,\"\",\"* Pacientes 15 a 19 años (Hombres) con HbA1C<7% debe ser menor o igual a Diabéticos en Sección A. \")","v":""},{"$f":"IF($G$36<=$G$17,\"\",\"* Pacientes 15 a 19 años (Mujeres) con HbA1C<7% debe ser menor o igual a Diabéticos en Sección A. \")","v":""},{"$f":"IF($H$36<=$H$17,\"\",\"* Pacientes 20 a 24 años (Hombres) con HbA1C<7% debe ser menor o igual a Diabéticos en Sección A. \")","v":""},{"$f":"IF($I$36<=$I$17,\"\",\"* Pacientes 20 a 24 años (Mujeres) con HbA1C<7% debe ser menor o igual a Diabéticos en Sección A. \")","v":""},{"$f":"IF($J$36<=$J$17,\"\",\"* Pacientes 25 a 29 años (Hombres) con HbA1C<7% debe ser menor o igual a Diabéticos en Sección A. \")","v":""},{"$f":"IF($K$36<=$K$17,\"\",\"* Pacientes 25 a 29 años (Mujeres) con HbA1C<7% debe ser menor o igual a Diabéticos en Sección A. \")","v":""},{"$f":"IF($L$36<=$L$17,\"\",\"* Pacientes 30 a 34 años (Hombres) con HbA1C<7% debe ser menor o igual a Diabéticos en Sección A. \")","v":""},{"$f":"IF($M$36<=$M$17,\"\",\"* Pacientes 30 a 34 años (Mujeres) con HbA1C<7% debe ser menor o igual a Diabéticos en Sección A. \")","v":""},{"$f":"IF($N$36<=$N$17,\"\",\"* Pacientes 35 a 39 años (Hombres) con HbA1C<7% debe ser menor o igual a Diabéticos en Sección A. \")","v":""},{"$f":"IF($O$36<=$O$17,\"\",\"* Pacientes 35 a 39 años (Mujeres) con HbA1C<7% debe ser menor o igual a Diabéticos en Sección A. \")","v":""},{"$f":"IF($P$36<=$P$17,\"\",\"* Pacientes 40 a 44 años (Hombres) con HbA1C<7% debe ser menor o igual a Diabéticos en Sección A. \")","v":""},{"$f":"IF($Q$36<=$Q$17,\"\",\"* Pacientes 40 a 44 años (Mujeres) con HbA1C<7% debe ser menor o igual a Diabéticos en Sección A. \")","v":""},{"$f":"IF($R$36<=$R$17,\"\",\"* Pacientes 45 a 49 años (Hombres) con HbA1C<7% debe ser menor o igual a Diabéticos en Sección A. \")","v":""},{"$f":"IF($S$36<=$S$17,\"\",\"* Pacientes 45 a 49 años (Mujeres) con HbA1C<7% debe ser menor o igual a Diabéticos en Sección A. \")","v":""},{"$f":"IF($T$36<=$T$17,\"\",\"* Pacientes 50 a 54 años (Hombres) con HbA1C<7% debe ser menor o igual a Diabéticos en Sección A. \")","v":""},{"$f":"IF($U$36<=$U$17,\"\",\"* Pacientes 50 a 54 años (Mujeres) con HbA1C<7% debe ser menor o igual a Diabéticos en Sección A. \")","v":""},{"$f":"IF($V$36<=$V$17,\"\",\"* Pacientes 55 a 59 años (Hombres) con HbA1C<7% debe ser menor o igual a Diabéticos en Sección A. \")","v":""},{"$f":"IF($W$36<=$W$17,\"\",\"* Pacientes 55 a 59 años (Mujeres) con HbA1C<7% debe ser menor o igual a Diabéticos en Sección A. \")","v":""},{"$f":"IF($X$36<=$X$17,\"\",\"* Pacientes 60 a 64 años (Hombres) con HbA1C<7% debe ser menor o igual a Diabéticos en Sección A. \")","v":""},{"$f":"IF($Y$36<=$Y$17,\"\",\"* Pacientes 60 a 64 años (Mujeres) con HbA1C<7% debe ser menor o igual a Diabéticos en Sección A. \")","v":""},{"$f":"IF($Z$36<=$Z$17,\"\",\"* Pacientes 65 a 69 años (Hombres) con HbA1C<7% debe ser menor o igual a Diabéticos en Sección A. \")","v":""},{"$f":"IF($AA$36<=$AA$17,\"\",\"* Pacientes 65 a 69 años (Mujeres) con HbA1C<7% debe ser menor o igual a Diabéticos en Sección A. \")","v":""},{"$f":"IF($AB$36<=$AB$17,\"\",\"* Pacientes 70 a 74 años (Hombres) con HbA1C<7% debe ser menor o igual a Diabéticos en Sección A. \")","v":""},{"$f":"IF($AC$36<=$AC$17,\"\",\"* Pacientes 70 a 74 años (Mujeres) con HbA1C<7% debe ser menor o igual a Diabéticos en Sección A. \")","v":""},{"$f":"IF($AD$36<=$AD$17,\"\",\"* Pacientes 75 a 79 años (Hombres) con HbA1C<7% debe ser menor o igual a Diabéticos en Sección A. \")","v":""},{"$f":"IF($AE$36<=$AE$17,\"\",\"* Pacientes 75 a 79 años (Mujeres) con HbA1C<7% debe ser menor o igual a Diabéticos en Sección A. \")","v":""},{"$f":"IF($AF$36<=$AF$17,\"\",\"* Pacientes 80 y más años (Hombres) con HbA1C<7% debe ser menor o igual a Diabéticos en Sección A. \")","v":""},{"$f":"IF($AG$37<=$AG$17,\"\",\"* Pacientes 80 y más años (Mujeres) con HbA1C<8% debe ser menor o igual a Diabéticos en Sección A. \")","v":""},null,null,0,0,{"$f":"IF($D$36>=$AH$36,0,1)","v":0},{"$f":"IF($E$36>=$AI$36,0,1)","v":0},0,{"$f":"IF($E36>=$AK36,0,1)","v":0},{"$f":"IF(F$36<=F$17,0,1)","v":0},0,0,0,0,0,0,0,0,0,0,0,0,0,0,0,0,0,0,0,0,0,0,0,0,0,0,0]
[null,"HbA1C<8%",0,{"$f":"+AF37","v":0},{"$f":"+AG37","v":0},null,null,null,null,null,null,null,null,null,null,null,null,null,null,null,null,null,null,null,null,null,null,null,null,null,null,null,null,null,null,null,null,{"$f":" BD37 & BE37 & BF37 & BG37 & BB37 & BC37","v":""},null,null,null,null,null,null,null,null,null,null,null,null,null,null,null,"","",{"$f":"IF($D$37>=$AH$37,\"\",\"* Pueblos Originarios-Hombres no debe ser mayor al Total de personas Hombres. \")","v":""},{"$f":"IF($E$37>=$AI$37,\"\",\"* Pueblos Originarios-Mujeres no debe ser mayor al Total de personas Mujeres. \")","v":""},"","",null,null,null,null,null,null,null,null,null,null,null,null,null,null,null,null,null,null,null,null,null,null,null,null,null,null,null,null,null,null,0,0,{"$f":"IF($D$37>=$AH$37,0,1)","v":0},{"$f":"IF($E$37>=$AI$37,0,1)","v":0},{"$f":"IF($D37>=$AJ37,0,1)","v":0},{"$f":"IF($E37>=$AK37,0,1)","v":0}]
[null,"HbA1C<7% - PA < 140/90mmHg y Colesterol LDL < 100 mg/dl",0,{"$f":"+F38+H38+J38+L38+N38+P38+R38+T38+V38+X38+Z38+AB38+AD38+AF38","v":0},{"$f":"+G38+I38+K38+M38+O38+Q38+S38+U38+W38+Y38+AA38+AC38+AE38+AG38","v":0},null,null,null,null,null,null,null,null,null,null,null,null,null,null,null,null,null,null,null,null,null,null,null,null,null,null,null,null,null,null,null,null,{"$f":" BD38 & BE38 & BH38 & BI38 & BJ38 & BK38 & BL38 & BM38 & BN38 & BO38 & BP38 & BQ38 & BR38 & BS38 & BT38 & BU38 & BV38 & BW38 & BX38 & BY38 & BZ38 & CA38 & CB38 & CC38 & CD38 & CE38 & CF38 & CH38 & CI38 & CG38 & BF38 & BG38 & BB38 & BC38","v":""},null,null,null,null,null,null,null,null,null,null,null,null,null,null,null,"","",{"$f":"IF($D$38>=$AH$38,\"\",\"* Pueblos Originarios-Hombres no debe ser mayor al Total de personas Hombres. \")","v":""},{"$f":"IF($E$38>=$AI$38,\"\",\"* Pueblos Originarios-Mujeres no debe ser mayor al Total de personas Mujeres. \")","v":""},"","",{"$f":"IF($F$38<=$F$36,\"\",\"* Pacientes 15 a 19 años (Hombres) con HbA1C<7% - PA<140/90mmHg debe ser menor o igual a los con HbA1C<7%. \")","v":""},{"$f":"IF($G$38<=$G$36,\"\",\"* Pacientes 15 a 19 años (Mujeres) con HbA1C<7% - PA<140/90mmHg debe ser menor o igual a los con HbA1C<7%. \")","v":""},{"$f":"IF($H$38<=$H$36,\"\",\"* Pacientes 20 a 24 años (Hombres) con HbA1C<7% - PA<140/90mmHg debe ser menor o igual a los con HbA1C<7%. \")","v":""},{"$f":"IF($I$38<=$I$36,\"\",\"* Pacientes 20 a 24 años (Mujeres) con HbA1C<7% - PA<140/90mmHg debe ser menor o igual a los con HbA1C<7%. \")","v":""},{"$f":"IF($J$38<=$J$36,\"\",\"* Pacientes 25 a 29 años (Hombres) con HbA1C<7% - PA<140/90mmHg debe ser menor o igual a los con HbA1C<7%. \")","v":""},{"$f":"IF($K$38<=$K$36,\"\",\"* Pacientes 25 a 29 años (Mujeres) con HbA1C<7% - PA<140/90mmHg debe ser menor o igual a los con HbA1C<7%. \")","v":""},{"$f":"IF($L$38<=$L$36,\"\",\"* Pacientes 30 a 34 años (Hombres) con HbA1C<7% - PA<140/90mmHg debe ser menor o igual a los con HbA1C<7%. \")","v":""},{"$f":"IF($M$38<=$M$36,\"\",\"* Pacientes 30 a 34 años (Mujeres) con HbA1C<7% - PA<140/90mmHg debe ser menor o igual a los con HbA1C<7%. \")","v":""},{"$f":"IF($N$38<=$N$36,\"\",\"* Pacientes 35 a 39 años (Hombres) con HbA1C<7% - PA<140/90mmHg debe ser menor o igual a los con HbA1C<7%. \")","v":""},{"$f":"IF($O$38<=$O$36,\"\",\"* Pacientes 35 a 39 años (Mujeres) con HbA1C<7% - PA<140/90mmHg debe ser menor o igual a los con HbA1C<7%. \")","v":""},{"$f":"IF($P$38<=$P$36,\"\",\"* Pacientes 40 a 44 años (Hombres) con HbA1C<7% - PA<140/90mmHg debe ser menor o igual a los con HbA1C<7%. \")","v":""},{"$f":"IF($Q$38<=$Q$36,\"\",\"* Pacientes 40 a 44 años (Mujeres) con HbA1C<7% - PA<140/90mmHg debe ser menor o igual a los con HbA1C<7%. \")","v":""},{"$f":"IF($R$38<=$R$36,\"\",\"* Pacientes 45 a 49 años (Hombres) con HbA1C<7% - PA<140/90mmHg debe ser menor o igual a los con HbA1C<7%. \")","v":""},{"$f":"IF($S$38<=$S$36,\"\",\"* Pacientes 45 a 49 años (Mujeres) con HbA1C<7% - PA<140/90mmHg debe ser menor o igual a los con HbA1C<7%. \")","v":""},{"$f":"IF($T$38<=$T$36,\"\",\"* Pacientes 50 a 54 años (Hombres) con HbA1C<7% - PA<140/90mmHg debe ser menor o igual a los con HbA1C<7%. \")","v":""},{"$f":"IF($U$38<=$U$36,\"\",\"* Pacientes 50 a 54 años (Mujeres) con HbA1C<7% - PA<140/90mmHg debe ser menor o igual a los con HbA1C<7%. \")","v":""},{"$f":"IF($V$38<=$V$36,\"\",\"* Pacientes 55 a 59 años (Hombres) con HbA1C<7% - PA<140/90mmHg debe ser menor o igual a los con HbA1C<7%. \")","v":""},{"$f":"IF($W$38<=$W$36,\"\",\"* Pacientes 55 a 59 años (Mujeres) con HbA1C<7% - PA<140/90mmHg debe ser menor o igual a los con HbA1C<7%. \")","v":""},{"$f":"IF($X$38<=$X$36,\"\",\"* Pacientes 60 a 64 años (Hombres) con HbA1C<7% - PA<140/90mmHg debe ser menor o igual a los con HbA1C<7%. \")","v":""},{"$f":"IF($Y$38<=$Y$36,\"\",\"* Pacientes 60 a 64 años (Mujeres) con HbA1C<7% - PA<140/90mmHg debe ser menor o igual a los con HbA1C<7%. \")","v":""},{"$f":"IF($Z$38<=$Z$36,\"\",\"* Pacientes 65 a 69 años (Hombres) con HbA1C<7% - PA<140/90mmHg debe ser menor o igual a los con HbA1C<7%. \")","v":""},{"$f":"IF($AA$38<=$AA$36,\"\",\"* Pacientes 65 a 69 años (Mujeres) con HbA1C<7% - PA<140/90mmHg debe ser menor o igual a los con HbA1C<7%. \")","v":""},{"$f":"IF($AB$38<=$AB$36,\"\",\"* Pacientes 70 a 74 años (Hombres) con HbA1C<7% - PA<140/90mmHg debe ser menor o igual a los con HbA1C<7%. \")","v":""},{"$f":"IF($AC$38<=$AC$36,\"\",\"* Pacientes 70 a 74 años (Mujeres) con HbA1C<7% - PA<140/90mmHg debe ser menor o igual a los con HbA1C<7%. \")","v":""},{"$f":"IF($AD$38<=$AD$36,\"\",\"* Pacientes 75 a 79 años (Hombres) con HbA1C<7% - PA<140/90mmHg debe ser menor o igual a los con HbA1C<7%. \")","v":""},{"$f":"IF($AE$38<=$AE$36,\"\",\"* Pacientes 75 a 79 años (Mujeres) con HbA1C<7% - PA<140/70mmHg debe ser menor o igual a los con HbA1C<7%. \")","v":""},null,null,null,null,0,0,{"$f":"IF($D$38>=$AH$38,0,1)","v":0},{"$f":"IF($E$38>=$AI$38,0,1)","v":0},0,{"$f":"IF($E38>=$AK38,0,1)","v":0},{"$f":"IF(F$38<=F$36,0,1)","v":0},0,0,0,0,0,0,0,0,0,0,0,0,0,0,0,0,0,0,0,0,0,0,0,0,0]
["PERSONAS CON RCV ALTO","COLESTEROL LDL < 100 mg/dL",0,{"$f":"+F39+H39+J39+L39+N39+P39+R39+T39+V39+X39+Z39+AB39+AD39+AF39","v":0},0,null,null,null,null,null,null,null,null,null,null,null,null,null,null,null,null,null,null,null,null,null,null,null,null,null,null,null,null,null,null,null,null,{"$f":" BD39 & BE39 & BH39 & BI39 & BJ39 & BK39 & BL39 & BM39 & BN39 & BO39 & BP39 & BQ39 & BR39 & BS39 & BT39 & BU39 & BV39 & BW39 & BX39 & BY39 & BZ39 & CA39 & CB39 & CC39 & CD39 & CE39 & CF39 & CH39 & CI39 & CG39 & BF39 & BG39 & BB39 & BC39","v":""},null,null,null,null,null,null,null,null,null,null,null,null,null,null,null,"","",{"$f":"IF($D$39>=$AH$39,\"\",\"* Pueblos Originarios-Hombres no debe ser mayor al Total de personas Hombres. \")","v":""},{"$f":"IF($E$39>=$AI$39,\"\",\"* Pueblos Originarios-Mujeres no debe ser mayor al Total de personas Mujeres. \")","v":""},"","",{"$f":"IF($F$39<=$F$15,\"\",\"* Pacientes 15 a 19 años (Hombres) con RCV Alto con Colesterol LDL <100 mg/dl no debe ser mayor al Total RCV Alto de Sección A. \")","v":""},{"$f":"IF($G$39<=$G$15,\"\",\"* Pacientes 15 a 19 años (Mujeres) con RCV Alto con Colesterol LDL <100 mg/dl no debe ser mayor al Total RCV Alto de Sección A. \")","v":""},{"$f":"IF($H$39<=+$H$15,\"\",\"* Pacientes 20 a 24 años (Hombres) con RCV Alto con Colesterol LDL <100 mg/dl no debe ser mayor al Total RCV Alto de Sección A. \")","v":""},{"$f":"IF($I$39<=+$I$15,\"\",\"* Pacientes 20 a 24 años (Mujeres) con RCV Alto con Colesterol LDL <100 mg/dl no debe ser mayor al Total RCV Alto de Sección A. \")","v":""},{"$f":"IF($J$39<=+$J$15,\"\",\"* Pacientes 25 a 29 años (Hombres) con RCV Alto con Colesterol LDL <100 mg/dl no debe ser mayor al Total RCV Alto de Sección A. \")","v":""},{"$f":"IF($K$39<=+$K$15,\"\",\"* Pacientes 25 a 29 años (Mujeres) con RCV Alto con Colesterol LDL <100 mg/dl no debe ser mayor al Total RCV Alto de Sección A. \")","v":""},{"$f":"IF($L$39<=+$L$15,\"\",\"* Pacientes 30 a 34 años (Hombres) con RCV Alto con Colesterol LDL <100 mg/dl no debe ser mayor al Total RCV Alto de Sección A. \")","v":""},{"$f":"IF($M$39<=+$M$15,\"\",\"* Pacientes 30 a 34 años (Mujeres) con RCV Alto con Colesterol LDL <100 mg/dl no debe ser mayor al Total RCV Alto de Sección A. \")","v":""},{"$f":"IF($N$39<=+$N$15,\"\",\"* Pacientes 35 a 39 años (Hombres) con RCV Alto con Colesterol LDL <100 mg/dl no debe ser mayor al Total RCV Alto de Sección A. \")","v":""},{"$f":"IF($O$39<=+$O$15,\"\",\"* Pacientes 35 a 39 años (Mujeres) con RCV Alto con Colesterol LDL <100 mg/dl no debe ser mayor al Total RCV Alto de Sección A. \")","v":""},{"$f":"IF($P$39<=+$P$15,\"\",\"* Pacientes 40 a 44 años (Hombres) con RCV Alto con Colesterol LDL <100 mg/dl no debe ser mayor al Total RCV Alto de Sección A. \")","v":""},{"$f":"IF($Q$39<=+$Q$15,\"\",\"* Pacientes 40 a 44 años (Mujeres) con RCV Alto con Colesterol LDL <100 mg/dl no debe ser mayor al Total RCV Alto de Sección A. \")","v":""},{"$f":"IF($R$39<=+$R$15,\"\",\"* Pacientes 45 a 49 años (Hombres) con RCV Alto con Colesterol LDL <100 mg/dl no debe ser mayor al Total RCV Alto de Sección A. \")","v":""},{"$f":"IF($S$39<=+$S$15,\"\",\"* Pacientes 45 a 49 años (Mujeres) con RCV Alto con Colesterol LDL <100 mg/dl no debe ser mayor al Total RCV Alto de Sección A. \")","v":""},{"$f":"IF($T$39<=+$T$15,\"\",\"* Pacientes 50 a 54 años (Hombres) con RCV Alto con Colesterol LDL <100 mg/dl no debe ser mayor al Total RCV Alto de Sección A. \")","v":""},{"$f":"IF($U$39<=+$U$15,\"\",\"* Pacientes 50 a 54 años (Mujeres) con RCV Alto con Colesterol LDL <100 mg/dl no debe ser mayor al Total RCV Alto de Sección A. \")","v":""},{"$f":"IF($V$39<=+$V$15,\"\",\"* Pacientes 55 a 59 años (Hombres) con RCV Alto con Colesterol LDL <100 mg/dl no debe ser mayor al Total RCV Alto de Sección A. \")","v":""},{"$f":"IF($W$39<=+$W$15,\"\",\"* Pacientes 55 a 59 años (Mujeres) con RCV Alto con Colesterol LDL <100 mg/dl no debe ser mayor al Total RCV Alto de Sección A. \")","v":""},{"$f":"IF($X$39<=+$X$15,\"\",\"* Pacientes 60 a 64 años (Hombres) con RCV Alto con Colesterol LDL <100 mg/dl no debe ser mayor al Total RCV Alto de Sección A. \")","v":""},{"$f":"IF($Y$39<=+$Y$15,\"\",\"* Pacientes 60 a 64 años (Mujeres) con RCV Alto con Colesterol LDL <100 mg/dl no debe ser mayor al Total RCV Alto de Sección A. \")","v":""},{"$f":"IF($Z$39<=+$Z$15,\"\",\"* Pacientes 65 a 69 años (Hombres) con RCV Alto con Colesterol LDL <100 mg/dl no debe ser mayor al Total RCV Alto de Sección A. \")","v":""},{"$f":"IF($AA$39<=+$AA$15,\"\",\"* Pacientes 65 a 69 años (Mujeres) con RCV Alto con Colesterol LDL <100 mg/dl no debe ser mayor al Total RCV Alto de Sección A. \")","v":""},{"$f":"IF($AB$39<=+$AB$15,\"\",\"* Pacientes 70 a 74 años (Hombres) con RCV Alto con Colesterol LDL <100 mg/dl no debe ser mayor al Total RCV Alto de Sección A. \")","v":""},{"$f":"IF($AC$39<=+$AC$15,\"\",\"* Pacientes 70 a 74 años (Mujeres) con RCV Alto con Colesterol LDL <100 mg/dl no debe ser mayor al Total RCV Alto de Sección A. \")","v":""},{"$f":"IF($AD$39<=+$AD$15,\"\",\"* Pacientes 75 a 79 años (Hombres) con RCV Alto con Colesterol LDL <100 mg/dl no debe ser mayor al Total RCV Alto de Sección A. \")","v":""},{"$f":"IF($AE$39<=+$AE$15,\"\",\"* Pacientes 75 a 79 años (Mujeres) con RCV Alto con Colesterol LDL <100 mg/dl no debe ser mayor al Total RCV Alto de Sección A. \")","v":""},{"$f":"IF($AF$39<=+$AF$15,\"\",\"* Pacientes 80 y más años (Hombres) con RCV Alto con Colesterol LDL <100 mg/dl no debe ser mayor al Total RCV Alto de Sección A. \")","v":""},{"$f":"IF($AG$39<=+$AG$15,\"\",\"* Pacientes 80 y más años (Mujeres) con RCV Alto con Colesterol LDL <100 mg/dl no debe ser mayor al Total RCV Alto de Sección A. \")","v":""},null,null,0,0,{"$f":"IF($D$39>=$AH$39,0,1)","v":0},{"$f":"IF($E$39>=$AI$39,0,1)","v":0},0,{"$f":"IF($E39>=$AJ39,0,1)","v":0},{"$f":"IF(F$39<=+F$15,0,1)","v":0},0,0,0,0,0,0,0,0,0,0,0,0,0,0,0,0,0,0,0,0,0,0,0,0,0,0,0]
["PERSONAS BAJO CONTROL con antecedentes Enfermedad Cardiovascular (ECV)","En tratamiento con Antiagregantes plaquetarios",0,0,0,null,null,null,null,null,null,null,null,null,null,null,null,null,null,null,null,null,null,null,null,null,null,null,null,null,null,null,null,null,null,null,null,{"$f":" BD40 & BE40 & BH40 & BI40 & BJ40 & BK40 & BL40 & BM40 & BN40 & BO40 & BP40 & BQ40 & BR40 & BS40 & BT40 & BU40 & BV40 & BW40 & BX40 & BY40 & BZ40 & CA40 & CB40 & CC40 & CD40 & CE40 & CF40 & CH40 & CI40 & CG40 & BF40 & BG40 & BB40 & BC40","v":""},null,null,null,null,null,null,null,null,null,null,null,null,null,null,null,"","",{"$f":"IF($D$40>=$AH$40,\"\",\"* Pueblos Originarios-Hombres no debe ser mayor al Total de personas Hombres. \")","v":""},{"$f":"IF($E$40>=$AI$40,\"\",\"* Pueblos Originarios-Mujeres no debe ser mayor al Total de personas Mujeres. \")","v":""},"","",{"$f":"IF($F$40<=$F$20+$F$21,\"\",\"* Pacientes 15 a 19 años (Hombres) con con antecedentes ECV con tto. Antiagregante plaquetario no debe ser mayor al Total Población con Antecedentes de IAM y ECV de Sección A. \")","v":""},{"$f":"IF($G$40<=$G$20+$G$21,\"\",\"* Pacientes 15 a 19 años (Mujeres) con con antecedentes ECV con tto. Antiagregante plaquetario no debe ser mayor al Total Población con Antecedentes de IAM y ECV de Sección A. \")","v":""},{"$f":"IF($H$40<=$H$20+$H$21,\"\",\"* Pacientes 20 a 24 años (Hombres) con con antecedentes ECV con tto. Antiagregante plaquetario no debe ser mayor al Total Población con Antecedentes de IAM y ECV de Sección A. \")","v":""},{"$f":"IF($I$40<=$I$20+$I$21,\"\",\"* Pacientes 20 a 24 años (Mujeres) con con antecedentes ECV con tto. Antiagregante plaquetario no debe ser mayor al Total Población con Antecedentes de IAM y ECV de Sección A. \")","v":""},{"$f":"IF($J$40<=$J$20+$J$21,\"\",\"* Pacientes 25 a 29 años (Hombres) con con antecedentes ECV con tto. Antiagregante plaquetario no debe ser mayor al Total Población con Antecedentes de IAM y ECV de Sección A. \")","v":""},{"$f":"IF($K$40<=$K$20+$K$21,\"\",\"* Pacientes 25 a 29 años (Mujeres) con con antecedentes ECV con tto. Antiagregante plaquetario no debe ser mayor al Total Población con Antecedentes de IAM y ECV de Sección A. \")","v":""},{"$f":"IF($L$40<=$L$20+$L$21,\"\",\"* Pacientes 30 a 34 años (Hombres) con con antecedentes ECV con tto. Antiagregante plaquetario no debe ser mayor al Total Población con Antecedentes de IAM y ECV de Sección A. \")","v":""},{"$f":"IF($M$40<=$M$20+$M$21,\"\",\"* Pacientes 30 a 34 años (Mujeres) con con antecedentes ECV con tto. Antiagregante plaquetario no debe ser mayor al Total Población con Antecedentes de IAM y ECV de Sección A. \")","v":""},{"$f":"IF($N$40<=$N$20+$N$21,\"\",\"* Pacientes 35 a 39 años (Hombres) con con antecedentes ECV con tto. Antiagregante plaquetario no debe ser mayor al Total Población con Antecedentes de IAM y ECV de Sección A. \")","v":""},{"$f":"IF($O$40<=$O$20+$O$21,\"\",\"* Pacientes 35 a 39 años (Mujeres) con con antecedentes ECV con tto. Antiagregante plaquetario no debe ser mayor al Total Población con Antecedentes de IAM y ECV de Sección A. \")","v":""},{"$f":"IF($P$40<=$P$20+$P$21,\"\",\"* Pacientes 40 a 44 años (Hombres) con con antecedentes ECV con tto.Antiagregante plaquetario no debe ser mayor al Total Población con Antecedentes de IAM y ECV de Sección A. \")","v":""},{"$f":"IF($Q$40<=$Q$20+$Q$21,\"\",\"* Pacientes 40 a 44 años (Mujeres) con con antecedentes ECV con tto. Antiagregante plaquetario no debe ser mayor al Total Población con Antecedentes de IAM y ECV de Sección A. \")","v":""},{"$f":"IF($R$40<=$R$20+$R$21,\"\",\"* Pacientes 45 a 49 años (Hombres) con con antecedentes ECV con tto.Antiagregante plaquetario no debe ser mayor al Total Población con Antecedentes de IAM y ECV de Sección A. \")","v":""},{"$f":"IF($S$40<=$S$20+$S$21,\"\",\"* Pacientes 45 a 49 años (Mujeres) con con antecedentes ECV con tto. Antiagregante plaquetario no debe ser mayor al Total Población con Antecedentes de IAM y ECV de Sección A. \")","v":""},{"$f":"IF($T$40<=$T$20+$T$21,\"\",\"* Pacientes 50 a 54 años (Hombres) con con antecedentes ECV con tto. Antiagregante plaquetario no debe ser mayor al Total Población con Antecedentes de IAM y ECV de Sección A. \")","v":""},{"$f":"IF($U$40<=$U$20+$U$21,\"\",\"* Pacientes 50 a 54 años (Mujeres) con con antecedentes ECV con tto. Antiagregante plaquetario no debe ser mayor al Total Población con Antecedentes de IAM y ECV de Sección A. \")","v":""},{"$f":"IF($V$40<=$V$20+$V$21,\"\",\"* Pacientes 55 a 59 años (Hombres) con con antecedentes ECV con tto. Antiagregante plaquetario no debe ser mayor al Total Población con Antecedentes de IAM y ECV de Sección A. \")","v":""},{"$f":"IF($W$40<=$W$20+$W$21,\"\",\"* Pacientes 55 a 59 años (Mujeres) con con antecedentes ECV con tto. Antiagregante plaquetario no debe ser mayor al Total Población con Antecedentes de IAM y ECV de Sección A. \")","v":""},{"$f":"IF($X$40<=$X$20+$X$21,\"\",\"* Pacientes 60 a 64 años (Hombres) con con antecedentes ECV con tto. Antiagregante plaquetario no debe ser mayor al Total Población con Antecedentes de IAM y ECV de Sección A. \")","v":""},{"$f":"IF($Y$40<=$Y$20+$Y$21,\"\",\"* Pacientes 60 a 64 años (Mujeres) con con antecedentes ECV con tto. Antiagregante plaquetario no debe ser mayor al Total Población con Antecedentes de IAM y ECV de Sección A. \")","v":""},{"$f":"IF($Z$40<=$Z$20+$Z$21,\"\",\"* Pacientes 65 a 69 años (Hombres) con con antecedentes ECV con tto. Antiagregante plaquetario no debe ser mayor al Total Población con Antecedentes de IAM y ECV de Sección A. \")","v":""},{"$f":"IF($AA$40<=$AA$20+$AA$21,\"\",\"* Pacientes 65 a 69 años (Mujeres) con con antecedentes ECV con tto. Antiagregante plaquetario no debe ser mayor al Total Población con Antecedentes de IAM y ECV de Sección A. \")","v":""},{"$f":"IF($AB$40<=$AB$20+$AB$21,\"\",\"* Pacientes 70 a 74 años (Hombres) con con antecedentes ECV con tto. Antiagregante plaquetario no debe ser mayor al Total Población con Antecedentes de IAM y ECV de Sección A. \")","v":""},{"$f":"IF($AC$40<=$AC$20+$AC$21,\"\",\"* Pacientes 70 a 74 años (Mujeres) con con antecedentes ECV con tto. Antiagregante plaquetario no debe ser mayor al Total Población con Antecedentes de IAM y ECV de Sección A. \")","v":""},{"$f":"IF($AD$40<=$AD$20+$AD$21,\"\",\"* Pacientes 75 a 79 años (Hombres) con con antecedentes ECV con tto. Antiagregante plaquetario no debe ser mayor al Total Población con Antecedentes de IAM y ECV de Sección A. \")","v":""},{"$f":"IF($AE$40<=$AE$20+$AE$21,\"\",\"* Pacientes 75 a 79 años (Mujeres) con con antecedentes ECV con tto. Antiagregante plaquetario no debe ser mayor al Total Población con Antecedentes de IAM y ECV de Sección A. \")","v":""},{"$f":"IF($AF$40<=$AF$20+$AF$21,\"\",\"* Pacientes 80 y más años (Hombres) con con antecedentes ECV con tto. Antiagregante plaquetario no debe ser mayor al Total Población con Antecedentes de IAM y ECV de Sección A. \")","v":""},{"$f":"IF($AG$40<=$AG$20+$AG$21,\"\",\"* Pacientes 80 y más años (Mujeres) con con antecedentes ECV con tto. Antiagregante plaquetario no debe ser mayor al Total Población con Antecedentes de IAM y ECV de Sección A. \")","v":""},null,null,0,0,{"$f":"IF($D$40>=$AH$40,0,1)","v":0},{"$f":"IF($E$40>=$AI$40,0,1)","v":0},0,{"$f":"IF($E40>=$AJ40,0,1)","v":0},{"$f":"IF(F$40<=F$20+F$21,0,1)","v":0},0,0,0,0,0,0,0,0,0,0,0,0,0,0,0,0,0,0,0,0,0,0,0,0,0,0,0]
[null,"En tratamiento con Estatina",{"$f":"SUM(D41:E41)","v":0},{"$f":"+F41+H41+J41+L41+N41+P41+R41+T41+V41+X41+Z41+AB41+AD41+AF41","v":0},{"$f":"+G41+I41+K41+M41+O41+Q41+S41+U41+W41+Y41+AA41+AC41+AE41+AG41","v":0}]
[null,"Fumador actual",{"$f":"SUM(D42:E42)","v":0},{"$f":"+F42+H42+J42+L42+N42+P42+R42+T42+V42+X42+Z42+AB42+AD42+AF42","v":0},{"$f":"+G42+I42+K42+M42+O42+Q42+S42+U42+W42+Y42+AA42+AC42+AE42+AG42","v":0},null,null,null,null,null,null,null,null,null,null,null,null,null,null,null,null,null,null,null,null,null,null,null,null,null,null,null,null,null,null,null,null,{"$f":" BD42 & BE42 & BH42 & BI42 & BJ42 & BK42 & BL42 & BM42 & BN42 & BO42 & BP42 & BQ42 & BR42 & BS42 & BT42 & BU42 & BV42 & BW42 & BX42 & BY42 & BZ42 & CA42 & CB42 & CC42 & CD42 & CE42 & CF42 & CH42 & CI42 & CG42 & BG42 & BF42 & BB42 & BC42","v":""},null,null,null,null,null,null,null,null,null,null,null,null,null,null,null,"","",{"$f":"IF($D$42>=$AH$42,\"\",\"* Pueblos Originarios-Hombres no debe ser mayor al Total de personas Hombres. \")","v":""},{"$f":"IF($E$42>=$AI$42,\"\",\"* Pueblos Originarios-Mujeres no debe ser mayor al Total de personas Mujeres. \")","v":""},"","",{"$f":"IF($F$42<=$F$20+$F$21,\"\",\"* Pacientes 15 a 19 años (Hombres) con con antecedentes ECV con Estatina no debe ser mayor al Total Población con Antecedentes de IAM y ECV de Sección A. \")","v":""},{"$f":"IF($G$42<=$G$20+$G$21,\"\",\"* Pacientes 15 a 19 años (Mujeres) con con antecedentes ECV con Estatina no debe ser mayor al Total Población con Antecedentes de IAM y ECV de Sección A. \")","v":""},{"$f":"IF($H$42<=$H$20+$H$21,\"\",\"* Pacientes 20 a 24 años (Hombres) con con antecedentes ECV con Estatina no debe ser mayor al Total Población con Antecedentes de IAM y ECV de Sección A. \")","v":""},{"$f":"IF($I$42<=$I$20+$I$21,\"\",\"* Pacientes 20 a 24 años (Mujeres) con con antecedentes ECV con Estatina no debe ser mayor al Total Población con Antecedentes de IAM y ECV de Sección A. \")","v":""},{"$f":"IF($J$42<=$J$20+$J$21,\"\",\"* Pacientes 25 a 29 años (Hombres) con con antecedentes ECV con Estatina no debe ser mayor al Total Población con Antecedentes de IAM y ECV de Sección A. \")","v":""},{"$f":"IF($K$42<=$K$20+$K$21,\"\",\"* Pacientes 25 a 29 años (Mujeres) con con antecedentes ECV con Estatina no debe ser mayor al Total Población con Antecedentes de IAM y ECV de Sección A. \")","v":""},{"$f":"IF($L$42<=$L$20+$L$21,\"\",\"* Pacientes 30 a 34 años (Hombres) con con antecedentes ECV con Estatina no debe ser mayor al Total Población con Antecedentes de IAM y ECV de Sección A. \")","v":""},{"$f":"IF($M$42<=$M$20+$M$21,\"\",\"* Pacientes 30 a 34 años (Mujeres) con con antecedentes ECV con Estatina no debe ser mayor al Total Población con Antecedentes de IAM y ECV de Sección A. \")","v":""},{"$f":"IF($N$42<=$N$20+$N$21,\"\",\"* Pacientes 35 a 39 años (Hombres) con con antecedentes ECV con Estatina no debe ser mayor al Total Población con Antecedentes de IAM y ECV de Sección A. \")","v":""},{"$f":"IF($O$42<=$O$20+$O$21,\"\",\"* Pacientes 35 a 39 años (Mujeres) con con antecedentes ECV con Estatina no debe ser mayor al Total Población con Antecedentes de IAM y ECV de Sección A. \")","v":""},{"$f":"IF($P$42<=$P$20+$P$21,\"\",\"* Pacientes 40 a 44 años (Hombres) con con antecedentes ECV con Estatina no debe ser mayor al Total Población con Antecedentes de IAM y ECV de Sección A. \")","v":""},{"$f":"IF($Q$42<=$Q$20+$Q$21,\"\",\"* Pacientes 40 a 44 años (Mujeres) con con antecedentes ECV con Estatina no debe ser mayor al Total Población con Antecedentes de IAM y ECV de Sección A. \")","v":""},{"$f":"IF($R$42<=$R$20+$R$21,\"\",\"* Pacientes 45 a 49 años (Hombres) con con antecedentes ECV con Estatina no debe ser mayor al Total Población con Antecedentes de IAM y ECV de Sección A. \")","v":""},{"$f":"IF($S$42<=$S$20+$S$21,\"\",\"* Pacientes 45 a 49 años (Mujeres) con con antecedentes ECV con Estatina no debe ser mayor al Total Población con Antecedentes de IAM y ECV de Sección A. \")","v":""},{"$f":"IF($T$42<=$T$20+$T$21,\"\",\"* Pacientes 50 a 54 años (Hombres) con con antecedentes ECV con Estatina no debe ser mayor al Total Población con Antecedentes de IAM y ECV de Sección A. \")","v":""},{"$f":"IF($U$42<=$U$20+$U$21,\"\",\"* Pacientes 50 a 54 años (Mujeres) con con antecedentes ECV con Estatina no debe ser mayor al Total Población con Antecedentes de IAM y ECV de Sección A. \")","v":""},{"$f":"IF($V$42<=$V$20+$V$21,\"\",\"* Pacientes 55 a 59 años (Hombres) con con antecedentes ECV con Estatina no debe ser mayor al Total Población con Antecedentes de IAM y ECV de Sección A. \")","v":""},{"$f":"IF($W$42<=$W$20+$W$21,\"\",\"* Pacientes 55 a 59 años (Mujeres) con con antecedentes ECV con Estatina no debe ser mayor al Total Población con Antecedentes de IAM y ECV de Sección A. \")","v":""},{"$f":"IF($X$42<=$X$20+$X$21,\"\",\"* Pacientes 60 a 64 años (Hombres) con con antecedentes ECV con Estatina no debe ser mayor al Total Población con Antecedentes de IAM y ECV de Sección A. \")","v":""},{"$f":"IF($Y$42<=$Y$20+$Y$21,\"\",\"* Pacientes 60 a 64 años (Mujeres) con con antecedentes ECV con Estatina no debe ser mayor al Total Población con Antecedentes de IAM y ECV de Sección A. \")","v":""},{"$f":"IF($Z$42<=$Z$20+$Z$21,\"\",\"* Pacientes 65 a 69 años (Hombres) con con antecedentes ECV con Estatina no debe ser mayor al Total Población con Antecedentes de IAM y ECV de Sección A. \")","v":""},{"$f":"IF($AA$42<=$AA$20+$AA$21,\"\",\"* Pacientes 65 a 69 años (Mujeres) con con antecedentes ECV con Estatina no debe ser mayor al Total Población con Antecedentes de IAM y ECV de Sección A. \")","v":""},{"$f":"IF($AB$42<=$AB$20+$AB$21,\"\",\"* Pacientes 70 a 74 años (Hombres) con con antecedentes ECV con Estatina no debe ser mayor al Total Población con Antecedentes de IAM y ECV de Sección A. \")","v":""},{"$f":"IF($AC$42<=$AC$20+$AC$21,\"\",\"* Pacientes 70 a 74 años (Mujeres) con con antecedentes ECV con Estatina no debe ser mayor al Total Población con Antecedentes de IAM y ECV de Sección A. \")","v":""},{"$f":"IF($AD$42<=$AD$20+$AD$21,\"\",\"* Pacientes 75 a 79 años (Hombres) con con antecedentes ECV con Estatina no debe ser mayor al Total Población con Antecedentes de IAM y ECV de Sección A. \")","v":""},{"$f":"IF($AE$42<=$AE$20+$AE$21,\"\",\"* Pacientes 75 a 79 años (Mujeres) con con antecedentes ECV con Estatina no debe ser mayor al Total Población con Antecedentes de IAM y ECV de Sección A. \")","v":""},{"$f":"IF($AF$42<=$AF$20+$AF$21,\"\",\"* Pacientes 80 y más años (Hombres) con con antecedentes ECV con Estatina no debe ser mayor al Total Población con Antecedentes de IAM y ECV de Sección A. \")","v":""},{"$f":"IF($AG$42<=$AG$20+$AG$21,\"\",\"* Pacientes 80 y más años (Mujeres) con con antecedentes ECV con Estatina no debe ser mayor al Total Población con Antecedentes de IAM y ECV de Sección A. \")","v":""},null,null,0,0,{"$f":"IF($D$42>=$AH$42,0,1)","v":0},{"$f":"IF($E$42>=$AI$42,0,1)","v":0},0,{"$f":"IF($E42>=$AJ42,0,1)","v":0},{"$f":"IF(F$42<=F$20+F$21,0,1)","v":0},0,0,0,0,0,0,0,0,0,0,0,0,0,0,0,0,0,0,0,0,0,0,0,0,0,0,0]
["SECCIÓN C: VARIABLES DE SEGUIMIENTO DEL PSCV AL CORTE"]
["VARIABLES",null,"TOTAL ",null,null,"GRUPOS DE EDAD (en años) Y SEXO",null,null,null,null,null,null,null,null,null,null,null,null,null,null,null,null,null,null,null,null,null,null,null,null,null,null,null,"Pueblos Originarios",null,"Población Migrantes",null,null,null,null,null,null,null,null,null,null,null,null,null,null,null,null,null,null,null,"Pueblos Originarios",null,"Población Migrantes",null,null,null,"Pueblos Originarios","Población Migrantes",null,null,null,null,null,null,null,null,null,null,null,null,null,null,null,null,null,null,null,null,null,null,null,null,null,null,null,null,"Pueblos Originarios",null,"Población Migrantes",null,null,null,null,null,"Pueblos Originarios","Población Migrantes"]
[null,null,null,null,null,"15 a 19 años",null,"20 a 24 años",null,"25 a 29 años",null,"30 a 34 años",null,"35 a 39 años",null,"40 a 44 años",null,"45 a 49 años",null,"50 a 54 años",null,"55 a 59 años",null,"60 a 64 años",null,"65 a 69 años",null,"70 a 74 años",null,"75 a 79 años",null,"80 y más años"]
[null,null,"Ambos\nsexos","Hombres","Mujeres","Hombres","Mujeres","Hombres","Mujeres","Hombres","Mujeres","Hombres","Mujeres","Hombres","Mujeres","Hombres","Mujeres","Hombres","Mujeres","Hombres","Mujeres","Hombres","Mujeres","Hombres","Mujeres","Hombres ","Mujeres","Hombres ","Mujeres","Hombres ","Mujeres","Hombres ","Mujeres","Hombres","Mujeres","Hombres","Mujeres",null,null,null,null,null,null,null,null,null,null,null,null,null,null,null,null,null,null,"Hombres","Mujeres","Hombres","Mujeres",null,null,"No Olvide","No Olvide",null,null,null,null,null,null,null,null,null,null,null,null,null,null,null,null,null,null,null,null,null,null,null,null,null,null,null,null,"Hombres","Mujeres","Hombres","Mujeres",null,null,null,null,"No Olvide","No Olvide"]
["PERSONAS CON DIABETES  EN PSCV"]
["CON RAZON ALBÚMINA CREATININA (RAC),VIGENTE",null,{"$f":"SUM(D48:E48)","v":0},{"$f":"+F48+H48+J48+L48+N48+P48+R48+T48+V48+X48+Z48+AB48+AD48+AF48","v":0},{"$f":"+G48+I48+K48+M48+O48+Q48+S48+U48+W48+Y48+AA48+AC48+AE48+AG48","v":0},null,null,null,null,null,null,null,null,null,null,null,null,null,null,null,null,null,null,null,null,null,null,null,null,null,null,null,null,null,null,null,null,{"$f":"BD48&BE48&BF48&BG48&BJ48&BK48","v":""},null,null,null,null,null,null,null,null,null,null,null,null,null,null,null,null,null,{"$f":"IF($D48>=$AH48,\"\",CONCATENATE(\"* Pueblos Originarios-Hombres no debe ser mayor al Total de personas \",A48,\".\"))","v":""},{"$f":"IF($E48>=$AI48,\"\",CONCATENATE(\"* Pueblos Originarios-Mujeres no debe ser mayor al Total de personas \",A48,\".\"))","v":""},{"$f":"IF($D48>=$AJ48,\"\",CONCATENATE(\"* Población Migrante-Hombres no debe ser mayor al Total de personas \",A48,\".\"))","v":""},{"$f":"IF($E48>=$AK48,\"\",CONCATENATE(\"* Población Migrante - Mujeres no debe ser mayor al Total de personas \",A48,\".\"))","v":""},null,null,{"$f":"IF(AND(D48<>0,AH48=\"\"),\"* No olvide escribir en la celda de 'Pueblos Originarios' (Digite CERO si no tiene). \",IF(AND(E48<>0,AI48=\"\"),\"* No olvide escribir en la celda de 'Pueblos Originarios' (Digite CERO si no tiene). \",\"\"))","v":""},{"$f":"IF(AND(D48<>0,AJ48=\"\"),\"* No olvide escribir en la celda de 'Población Migrantes' (Digite CERO si no tiene). \",IF(AND(E48<>0,AK48=\"\"),\"* No olvide escribir en la celda de 'Población Migrantes' (Digite CERO si no tiene). \",\"\"))","v":""},null,null,null,null,null,null,null,null,null,null,null,null,null,null,null,null,null,null,null,null,null,null,null,null,null,null,null,null,{"$f":"IF($D48>=$AH48,0,1)","v":0},{"$f":"IF($E48>=$AI48,0,1)","v":0},{"$f":"IF($D48>=$AJ48,0,1)","v":0},{"$f":"IF($E48>=$AK48,0,1)","v":0},null,null,null,null,{"$f":"IF(AND(D51<>0,AH51=\"\"),1,IF(AND(E51<>0,AI51=\"\"),1,0))","v":0},{"$f":"IF(AND(D51<>0,AJ51=\"\"),1,IF(AND(E51<>0,AK51=\"\"),1,0))","v":0}]
["CON VELOCIDAD DE FILTRACIÓN GLOMERULAR ESTIMADA (VFG), VIGENTE",null,{"$f":"SUM(D49:E49)","v":0},{"$f":"+F49+H49+J49+L49+N49+P49+R49+T49+V49+X49+Z49+AB49+AD49+AF49","v":0},{"$f":"+G49+I49+K49+M49+O49+Q49+S49+U49+W49+Y49+AA49+AC49+AE49+AG49","v":0},null,null,null,null,null,null,null,null,null,null,null,null,null,null,null,null,null,null,null,null,null,null,null,null,null,null,null,null,null,null,null,null,{"$f":"BD49&BE49&BF49&BG49&BJ49&BK49","v":""},null,null,null,null,null,null,null,null,null,null,null,null,null,null,null,null,null,{"$f":"IF($D49>=$AH49,\"\",CONCATENATE(\"* Pueblos Originarios-Hombres no debe ser mayor al Total de personas \",A49,\".\"))","v":""},{"$f":"IF($E49>=$AI49,\"\",CONCATENATE(\"* Pueblos Originarios-Mujeres no debe ser mayor al Total de personas \",A49,\".\"))","v":""},{"$f":"IF($D49>=$AJ49,\"\",CONCATENATE(\"* Población Migrante-Hombres no debe ser mayor al Total de personas \",A49,\".\"))","v":""},{"$f":"IF($E49>=$AK49,\"\",CONCATENATE(\"* Población Migrante - Mujeres no debe ser mayor al Total de personas \",A49,\".\"))","v":""},null,null,{"$f":"IF(AND(D49<>0,AH49=\"\"),\"* No olvide escribir en la celda de 'Pueblos Originarios' (Digite CERO si no tiene). \",IF(AND(E49<>0,AI49=\"\"),\"* No olvide escribir en la celda de 'Pueblos Originarios' (Digite CERO si no tiene). \",\"\"))","v":""},{"$f":"IF(AND(D49<>0,AJ49=\"\"),\"* No olvide escribir en la celda de 'Población Migrantes' (Digite CERO si no tiene). \",IF(AND(E49<>0,AK49=\"\"),\"* No olvide escribir en la celda de 'Población Migrantes' (Digite CERO si no tiene). \",\"\"))","v":""},null,null,null,null,null,null,null,null,null,null,null,null,null,null,null,null,null,null,null,null,null,null,null,null,null,null,null,null,{"$f":"IF($D49>=$AH49,0,1)","v":0},{"$f":"IF($E49>=$AI49,0,1)","v":0},{"$f":"IF($D49>=$AJ49,0,1)","v":0},{"$f":"IF($E49>=$AK49,0,1)","v":0},null,null,null,null,{"$f":"IF(AND(D52<>0,AH52=\"\"),1,IF(AND(E52<>0,AI52=\"\"),1,0))","v":0},{"$f":"IF(AND(D52<>0,AJ52=\"\"),1,IF(AND(E52<>0,AK52=\"\"),1,0))","v":0}]
["CON VELOCIDAD DE FILTRACIÓN GLOMERULAR ESTIMADA (VFGe) Y CON RAZON ALBÚMINA CREATININA (RAC) VIGENTE",null,{"$f":"SUM(D50:E50)","v":0},{"$f":"+F50+H50+J50+L50+N50+P50+R50+T50+V50+X50+Z50+AB50+AD50+AF50","v":0},{"$f":"+G50+I50+K50+M50+O50+Q50+S50+U50+W50+Y50+AA50+AC50+AE50+AG50","v":0}]
["CON FONDO DE OJO, VIGENTE",null,0,0,0,null,null,null,null,null,null,null,null,null,null,null,null,null,null,null,null,null,null,null,null,null,null,null,null,null,null,null,null,null,null,null,null,"",null,null,null,null,null,null,null,null,null,null,null,null,null,null,null,null,null,"","","","",null,null,"","",null,null,null,null,null,null,null,null,null,null,null,null,null,null,null,null,null,null,null,null,null,null,null,null,null,null,null,null,0,0,0,0,null,null,null,null,{"$f":"IF(AND(D53<>0,AH53=\"\"),1,IF(AND(E53<>0,AI53=\"\"),1,0))","v":0},{"$f":"IF(AND(D53<>0,AJ53=\"\"),1,IF(AND(E53<>0,AK53=\"\"),1,0))","v":0}]
["CON ATENCIÓN PODOLÓGICA VIGENTE",null,0,0,0,null,null,null,null,null,null,null,null,null,null,null,null,null,null,null,null,null,null,null,null,null,null,null,null,null,null,null,null,null,null,null,null,"",null,null,null,null,null,null,null,null,null,null,null,null,null,null,null,null,null,"","","","",null,null,"","",null,null,null,null,null,null,null,null,null,null,null,null,null,null,null,null,null,null,null,null,null,null,null,null,null,null,null,null,0,0,0,0,null,null,null,null,0,0]
["CON ECG VIGENTE",null,0,0,0,null,null,null,null,null,null,null,null,null,null,null,null,null,null,null,null,null,null,null,null,null,null,null,null,null,null,null,null,null,null,null,null,"",null,null,null,null,null,null,null,null,null,null,null,null,null,null,null,null,null,"","","","",null,null,"","",null,null,null,null,null,null,null,null,null,null,null,null,null,null,null,null,null,null,null,null,null,null,null,null,null,null,null,null,0,0,0,0,null,null,null,null,0,0]
["EN TRATAMIENTO CON INSULINA",null,0,0,0,null,null,null,null,null,null,null,null,null,null,null,null,null,null,null,null,null,null,null,null,null,null,null,null,null,null,null,null,null,null,null,null,"",null,null,null,null,null,null,null,null,null,null,null,null,null,null,null,null,null,"","","","",null,null,"","",null,null,null,null,null,null,null,null,null,null,null,null,null,null,null,null,null,null,null,null,null,null,null,null,null,null,null,null,0,0,0,0,null,null,null,null,{"$f":"IF(AND(D56<>0,AH56=\"\"),1,IF(AND(E56<>0,AI56=\"\"),1,0))","v":0},{"$f":"IF(AND(D56<>0,AJ56=\"\"),1,IF(AND(E56<>0,AK56=\"\"),1,0))","v":0}]
["EN  TRATAMIENTO CON INSULINA QUE LOGRA META CON  HbA1C SEGÚN EDAD",null,0,0,0,null,null,null,null,null,null,null,null,null,null,null,null,null,null,null,null,null,null,null,null,null,null,null,null,null,null,null,null,null,null,null,null,"",null,null,null,null,null,null,null,null,null,null,null,null,null,null,null,null,null,"","","","",null,null,"","",null,null,null,null,null,null,null,null,null,null,null,null,null,null,null,null,null,null,null,null,null,null,null,null,null,null,null,null,0,0,0,0,null,null,null,null,{"$f":"IF(AND(D58<>0,AH58=\"\"),1,IF(AND(E58<>0,AI58=\"\"),1,0))","v":0},{"$f":"IF(AND(D58<>0,AJ58=\"\"),1,IF(AND(E58<>0,AK58=\"\"),1,0))","v":0}]
["CON HbA1C>= 9 %",null,0,0,0,null,null,null,null,null,null,null,null,null,null,null,null,null,null,null,null,null,null,null,null,null,null,null,null,null,null,null,null,null,null,null,null,"",null,null,null,null,null,null,null,null,null,null,null,null,null,null,null,null,null,{"$f":"IF($D56>=$AH56,\"\",CONCATENATE(\"* Pueblos Originarios-Hombres no debe ser mayor al Total de personas \",A56,\".\"))","v":""},{"$f":"IF($E56>=$AI56,\"\",CONCATENATE(\"* Pueblos Originarios-Mujeres no debe ser mayor al Total de personas \",A56,\".\"))","v":""},{"$f":"IF($D56>=$AJ56,\"\",CONCATENATE(\"* Población Migrante-Hombres no debe ser mayor al Total de personas \",A56,\".\"))","v":""},{"$f":"IF($E56>=$AK56,\"\",CONCATENATE(\"* Población Migrante - Mujeres no debe ser mayor al Total de personas \",A56,\".\"))","v":""},null,null,"","",null,null,null,null,null,null,null,null,null,null,null,null,null,null,null,null,null,null,null,null,null,null,null,null,null,null,null,null,0,0,0,0,null,null,null,null,{"$f":"IF(AND(D59<>0,AH59=\"\"),1,IF(AND(E59<>0,AI59=\"\"),1,0))","v":0},{"$f":"IF(AND(D59<>0,AJ59=\"\"),1,IF(AND(E59<>0,AK59=\"\"),1,0))","v":0}]
["FUMADOR ACTUAL",null,{"$f":"SUM(D57:E57)","v":0},{"$f":"+F57+H57+J57+L57+N57+P57+R57+T57+V57+X57+Z57+AB57+AD57+AF57","v":0},{"$f":"+G57+I57+K57+M57+O57+Q57+S57+U57+W57+Y57+AA57+AC57+AE57+AG57","v":0}]
["CON ERC ETAPA 3B O SUPERIOR Y EN TRATAMIENTO CON IECA O ARA II.",null,0,{"$f":"+F58+H58+J58+L58+N58+P58+R58+T58+V58+X58+Z58+AB58+AD58+AF58","v":0},{"$f":"+G58+I58+K58+M58+O58+Q58+S58+U58+W58+Y58+AA58+AC58+AE58+AG58","v":0},null,null,null,null,null,null,null,null,null,null,null,null,null,null,null,null,null,null,null,null,null,null,null,null,null,null,null,null,null,null,null,null,"",null,null,null,null,null,null,null,null,null,null,null,null,null,null,null,null,null,{"$f":"IF($D58>=$AH58,\"\",CONCATENATE(\"* Pueblos Originarios-Hombres no debe ser mayor al Total de personas \",A58,\".\"))","v":""},{"$f":"IF($E58>=$AI58,\"\",CONCATENATE(\"* Pueblos Originarios-Mujeres no debe ser mayor al Total de personas \",A58,\".\"))","v":""},{"$f":"IF($D58>=$AJ58,\"\",CONCATENATE(\"* Población Migrante-Hombres no debe ser mayor al Total de personas \",A58,\".\"))","v":""},{"$f":"IF($E58>=$AK58,\"\",CONCATENATE(\"* Población Migrante - Mujeres no debe ser mayor al Total de personas \",A58,\".\"))","v":""},null,null,"","",null,null,null,null,null,null,null,null,null,null,null,null,null,null,null,null,null,null,null,null,null,null,null,null,null,null,null,null,0,0,0,0,null,null,null,null,0,0]
["CON UN EXÁMEN DE COLESTEROL LDL VIGENTE.",null,0,0,0,null,null,null,null,null,null,null,null,null,null,null,null,null,null,null,null,null,null,null,null,null,null,null,null,null,null,null,null,null,null,null,null,"",null,null,null,null,null,null,null,null,null,null,null,null,null,null,null,null,null,{"$f":"IF($D59>=$AH59,\"\",CONCATENATE(\"* Pueblos Originarios-Hombres no debe ser mayor al Total de personas \",A59,\".\"))","v":""},{"$f":"IF($E59>=$AI59,\"\",CONCATENATE(\"* Pueblos Originarios-Mujeres no debe ser mayor al Total de personas \",A59,\".\"))","v":""},{"$f":"IF($D59>=$AJ59,\"\",CONCATENATE(\"* Población Migrante-Hombres no debe ser mayor al Total de personas \",A59,\".\"))","v":""},{"$f":"IF($E59>=$AK59,\"\",CONCATENATE(\"* Población Migrante - Mujeres no debe ser mayor al Total de personas \",A59,\".\"))","v":""},null,null,"","",null,null,null,null,null,null,null,null,null,null,null,null,null,null,null,null,null,null,null,null,null,null,null,null,null,null,null,null,0,0,0,0,null,null,null,null,0,0]
["CON *EVALUACIÓN VIGENTE DEL PIE SEGÚN PAUTA DE ESTIMACION DEL RIESGO DE ULCERACION EN PERSONAS CON DIABETES","Riesgo bajo",0,0,0,null,null,null,null,null,null,null,null,null,null,null,null,null,null,null,null,null,null,null,null,null,null,null,null,null,null,null,null,null,null,null,null,"",null,null,null,null,null,null,null,null,null,null,null,null,null,null,null,null,null,{"$f":"IF($D60>=$AH60,\"\",CONCATENATE(\"* Pueblos Originarios-Hombres no debe ser mayor al Total de personas \",CONCATENATE($A$60,\"-\",B60),\".\"))","v":""},{"$f":"IF($E60>=$AI60,\"\",CONCATENATE(\"* Pueblos Originarios-Mujeres no debe ser mayor al Total de personas \",CONCATENATE($A$60,\"-\",B60),\".\"))","v":""},{"$f":"IF($D60>=$AJ60,\"\",CONCATENATE(\"* Población Migrante-Hombres no debe ser mayor al Total de personas \",CONCATENATE($A$60,\"-\",B60),\".\"))","v":""},{"$f":"IF($E60>=$AK60,\"\",CONCATENATE(\"* Población Migrante - Mujeres no debe ser mayor al Total de personas \",CONCATENATE($A$60,\"-\",B60),\".\"))","v":""},null,null,"","",null,null,null,null,null,null,null,null,null,null,null,null,null,null,null,null,null,null,null,null,null,null,null,null,null,null,null,null,0,0,0,0,null,null,null,null,0,0]
[null,"Riesgo moderado ",0,0,0,null,null,null,null,null,null,null,null,null,null,null,null,null,null,null,null,null,null,null,null,null,null,null,null,null,null,null,null,null,null,null,null,"",null,null,null,null,null,null,null,null,null,null,null,null,null,null,null,null,null,{"$f":"IF($D61>=$AH61,\"\",CONCATENATE(\"* Pueblos Originarios-Hombres no debe ser mayor al Total de personas \",CONCATENATE($A$60,\"-\",B61),\".\"))","v":""},{"$f":"IF($E61>=$AI61,\"\",CONCATENATE(\"* Pueblos Originarios-Mujeres no debe ser mayor al Total de personas \",CONCATENATE($A$60,\"-\",B61),\".\"))","v":""},{"$f":"IF($D61>=$AJ61,\"\",CONCATENATE(\"* Población Migrante-Hombres no debe ser mayor al Total de personas \",CONCATENATE($A$60,\"-\",B61),\".\"))","v":""},{"$f":"IF($E61>=$AK61,\"\",CONCATENATE(\"* Población Migrante - Mujeres no debe ser mayor al Total de personas \",CONCATENATE($A$60,\"-\",B61),\".\"))","v":""},null,null,"","",null,null,null,null,null,null,null,null,null,null,null,null,null,null,null,null,null,null,null,null,null,null,null,null,null,null,null,null,0,0,0,0,null,null,null,null,0,0]
[null,"Riesgo alto",0,0,0,null,null,null,null,null,null,null,null,null,null,null,null,null,null,null,null,null,null,null,null,null,null,null,null,null,null,null,null,null,null,null,null,"",null,null,null,null,null,null,null,null,null,null,null,null,null,null,null,null,null,{"$f":"IF($D62>=$AH62,\"\",CONCATENATE(\"* Pueblos Originarios-Hombres no debe ser mayor al Total de personas \",CONCATENATE($A$60,\"-\",B62),\".\"))","v":""},{"$f":"IF($E62>=$AI62,\"\",CONCATENATE(\"* Pueblos Originarios-Mujeres no debe ser mayor al Total de personas \",CONCATENATE($A$60,\"-\",B62),\".\"))","v":""},{"$f":"IF($D62>=$AJ62,\"\",CONCATENATE(\"* Población Migrante-Hombres no debe ser mayor al Total de personas \",CONCATENATE($A$60,\"-\",B62),\".\"))","v":""},{"$f":"IF($E62>=$AK62,\"\",CONCATENATE(\"* Población Migrante - Mujeres no debe ser mayor al Total de personas \",CONCATENATE($A$60,\"-\",B62),\".\"))","v":""},null,null,"","",null,null,null,null,null,null,null,null,null,null,null,null,null,null,null,null,null,null,null,null,null,null,null,null,null,null,null,null,0,0,0,0,null,null,null,null,0,0]
[null,"Riesgo máximo ",0,0,0,null,null,null,null,null,null,null,null,null,null,null,null,null,null,null,null,null,null,null,null,null,null,null,null,null,null,null,null,null,null,null,null,"",null,null,null,null,null,null,null,null,null,null,null,null,null,null,null,null,null,{"$f":"IF($D63>=$AH63,\"\",CONCATENATE(\"* Pueblos Originarios-Hombres no debe ser mayor al Total de personas \",CONCATENATE($A$60,\"-\",B63),\".\"))","v":""},{"$f":"IF($E63>=$AI63,\"\",CONCATENATE(\"* Pueblos Originarios-Mujeres no debe ser mayor al Total de personas \",CONCATENATE($A$60,\"-\",B63),\".\"))","v":""},{"$f":"IF($D63>=$AJ63,\"\",CONCATENATE(\"* Población Migrante-Hombres no debe ser mayor al Total de personas \",CONCATENATE($A$60,\"-\",B63),\".\"))","v":""},{"$f":"IF($E63>=$AK63,\"\",CONCATENATE(\"* Población Migrante - Mujeres no debe ser mayor al Total de personas \",CONCATENATE($A$60,\"-\",B63),\".\"))","v":""},null,null,"","",null,null,null,null,null,null,null,null,null,null,null,null,null,null,null,null,null,null,null,null,null,null,null,null,null,null,null,null,0,0,0,0,null,null,null,null,{"$f":"IF(AND(D66<>0,AH66=\"\"),1,IF(AND(E66<>0,AI66=\"\"),1,0))","v":0},{"$f":"IF(AND(D66<>0,AJ66=\"\"),1,IF(AND(E66<>0,AK66=\"\"),1,0))","v":0}]
["CON ÚLCERAS ACTIVAS DE PIE TRATADAS CON CURACIÓN ","Curación Convencional",0,0,0,null,null,null,null,null,null,null,null,null,null,null,null,null,null,null,null,null,null,null,null,null,null,null,null,null,null,null,null,null,null,null,null,"",null,null,null,null,null,null,null,null,null,null,null,null,null,null,null,null,null,{"$f":"IF($D64>=$AH64,\"\",CONCATENATE(\"* Pueblos Originarios-Hombres no debe ser mayor al Total de personas \",CONCATENATE($A$64,\"-\",B64),\".\"))","v":""},{"$f":"IF($E64>=$AI64,\"\",CONCATENATE(\"* Pueblos Originarios-Mujeres no debe ser mayor al Total de personas \",CONCATENATE($A$64,\"-\",B64),\".\"))","v":""},{"$f":"IF($D64>=$AJ64,\"\",CONCATENATE(\"* Población Migrante-Hombres no debe ser mayor al Total de personas \",CONCATENATE($A$64,\"-\",B64),\".\"))","v":""},{"$f":"IF($E64>=$AK64,\"\",CONCATENATE(\"* Población Migrante - Mujeres no debe ser mayor al Total de personas \",CONCATENATE($A$64,\"-\",B64),\".\"))","v":""},null,null,"","",null,null,null,null,null,null,null,null,null,null,null,null,null,null,null,null,null,null,null,null,null,null,null,null,null,null,null,null,0,0,0,0,null,null,null,null,{"$f":"IF(AND(D68<>0,AH68=\"\"),1,IF(AND(E68<>0,AI68=\"\"),1,0))","v":0},{"$f":"IF(AND(D68<>0,AJ68=\"\"),1,IF(AND(E68<>0,AK68=\"\"),1,0))","v":0}]
[null,"Curación Avanzada",{"$f":"SUM(D65:E65)","v":0},{"$f":"+F65+H65+J65+L65+N65+P65+R65+T65+V65+X65+Z65+AB65+AD65+AF65","v":0},{"$f":"+G65+I65+K65+M65+O65+Q65+S65+U65+W65+Y65+AA65+AC65+AE65+AG65","v":0}]
[null,"Con ayuda técnica de descarga",{"$f":"SUM(D66:E66)","v":0},{"$f":"+F66+H66+J66+L66+N66+P66+R66+T66+V66+X66+Z66+AB66+AD66+AF66","v":0},{"$f":"+G66+I66+K66+M66+O66+Q66+S66+U66+W66+Y66+AA66+AC66+AE66+AG66","v":0},null,null,null,null,null,null,null,null,null,null,null,null,null,null,null,null,null,null,null,null,null,null,null,null,null,null,null,null,null,null,null,null,"",null,null,null,null,null,null,null,null,null,null,null,null,null,null,null,null,null,{"$f":"IF($D66>=$AH66,\"\",CONCATENATE(\"* Pueblos Originarios-Hombres no debe ser mayor al Total de personas \",CONCATENATE($A$64,\"-\",B65),\".\"))","v":""},{"$f":"IF($E66>=$AI66,\"\",CONCATENATE(\"* Pueblos Originarios-Mujeres no debe ser mayor al Total de personas \",CONCATENATE($A$64,\"-\",B65),\".\"))","v":""},{"$f":"IF($D66>=$AJ66,\"\",CONCATENATE(\"* Población Migrante-Hombres no debe ser mayor al Total de personas \",CONCATENATE($A$64,\"-\",B65),\".\"))","v":""},{"$f":"IF($E66>=$AK66,\"\",CONCATENATE(\"* Población Migrante - Mujeres no debe ser mayor al Total de personas \",CONCATENATE($A$64,\"-\",B65),\".\"))","v":""},null,null,"","",null,null,null,null,null,null,null,null,null,null,null,null,null,null,null,null,null,null,null,null,null,null,null,null,null,null,null,null,0,0,0,0,null,null,null,null,{"$f":"IF(AND(D69<>0,AH69=\"\"),1,IF(AND(E69<>0,AI69=\"\"),1,0))","v":0},{"$f":"IF(AND(D69<>0,AJ69=\"\"),1,IF(AND(E69<>0,AK69=\"\"),1,0))","v":0}]
["CURACIÓN AVANZADA EN ULCERA VENOSA",null,0,{"$f":"+F67+H67+J67+L67+N67+P67+R67+T67+V67+X67+Z67+AB67+AD67+AF67","v":0},0]
["CON AMPUTACIÓN POR PIE DIABÉTICO",null,0,{"$f":"+F68+H68+J68+L68+N68+P68+R68+T68+V68+X68+Z68+AB68+AD68+AF68","v":0},{"$f":"+G68+I68+K68+M68+O68+Q68+S68+U68+W68+Y68+AA68+AC68+AE68+AG68","v":0},null,null,null,null,null,null,null,null,null,null,null,null,null,null,null,null,null,null,null,null,null,null,null,null,null,null,null,null,null,null,null,null,"",null,null,null,null,null,null,null,null,null,null,null,null,null,null,null,null,null,{"$f":"IF($D68>=$AH68,\"\",CONCATENATE(\"* Pueblos Originarios-Hombres no debe ser mayor al Total de personas \",A68,\".\"))","v":""},{"$f":"IF($E68>=$AI68,\"\",CONCATENATE(\"* Pueblos Originarios-Mujeres no debe ser mayor al Total de personas \",A68,\".\"))","v":""},{"$f":"IF($D68>=$AJ68,\"\",CONCATENATE(\"* Población Migrante-Hombres no debe ser mayor al Total de personas \",A68,\".\"))","v":""},{"$f":"IF($E68>=$AK68,\"\",CONCATENATE(\"* Población Migrante - Mujeres no debe ser mayor al Total de personas \",A68,\".\"))","v":""},null,null,"","",null,null,null,null,null,null,null,null,null,null,null,null,null,null,null,null,null,null,null,null,null,null,null,null,null,null,null,null,0,0,0,0,null,null,null,null,{"$f":"IF(AND(D71<>0,AH71=\"\"),1,IF(AND(E71<>0,AI71=\"\"),1,0))","v":0},{"$f":"IF(AND(D71<>0,AJ71=\"\"),1,IF(AND(E71<>0,AK71=\"\"),1,0))","v":0}]
["CON DIAGNÓSTICO ASOCIADO DE HIPERTENSIÓN ARTERIAL",null,0,0,0,null,null,null,null,null,null,null,null,null,null,null,null,null,null,null,null,null,null,null,null,null,null,null,null,null,null,null,null,null,null,null,null,"",null,null,null,null,null,null,null,null,null,null,null,null,null,null,null,null,null,{"$f":"IF($D69>=$AH69,\"\",CONCATENATE(\"* Pueblos Originarios-Hombres no debe ser mayor al Total de personas \",A69,\".\"))","v":""},{"$f":"IF($E69>=$AI69,\"\",CONCATENATE(\"* Pueblos Originarios-Mujeres no debe ser mayor al Total de personas \",A69,\".\"))","v":""},{"$f":"IF($D69>=$AJ69,\"\",CONCATENATE(\"* Población Migrante-Hombres no debe ser mayor al Total de personas \",A69,\".\"))","v":""},{"$f":"IF($E69>=$AK69,\"\",CONCATENATE(\"* Población Migrante - Mujeres no debe ser mayor al Total de personas \",A69,\".\"))","v":""},null,null,"","",null,null,null,null,null,null,null,null,null,null,null,null,null,null,null,null,null,null,null,null,null,null,null,null,null,null,null,null,0,0,0,0,null,null,null,null,{"$f":"IF(AND(D72<>0,AH72=\"\"),1,IF(AND(E72<>0,AI72=\"\"),1,0))","v":0},{"$f":"IF(AND(D72<>0,AJ72=\"\"),1,IF(AND(E72<>0,AK72=\"\"),1,0))","v":0}]
["CON DIAGNÓSTICO DE ENFERMEDAD RENAL CRÓNICA",null,{"$f":"SUM(D70:E70)","v":0},{"$f":"+F70+H70+J70+L70+N70+P70+R70+T70+V70+X70+Z70+AB70+AD70+AF70","v":0},{"$f":"+G70+I70+K70+M70+O70+Q70+S70+U70+W70+Y70+AA70+AC70+AE70+AG70","v":0}]
["ANTECEDENTE DE ATAQUE CEREBRO VASCULAR",null,{"$f":"SUM(D71:E71)","v":0},0,0,null,null,null,null,null,null,null,null,null,null,null,null,null,null,null,null,null,null,null,null,null,null,null,null,null,null,null,null,null,null,null,null,"",null,null,null,null,null,null,null,null,null,null,null,null,null,null,null,null,null,{"$f":"IF($D71>=$AH71,\"\",CONCATENATE(\"* Pueblos Originarios-Hombres no debe ser mayor al Total de personas \",A71,\".\"))","v":""},{"$f":"IF($E71>=$AI71,\"\",CONCATENATE(\"* Pueblos Originarios-Mujeres no debe ser mayor al Total de personas \",A71,\".\"))","v":""},{"$f":"IF($D71>=$AJ71,\"\",CONCATENATE(\"* Población Migrante-Hombres no debe ser mayor al Total de personas \",A71,\".\"))","v":""},{"$f":"IF($E71>=$AK71,\"\",CONCATENATE(\"* Población Migrante - Mujeres no debe ser mayor al Total de personas \",A71,\".\"))","v":""},null,null,"","",null,null,null,null,null,null,null,null,null,null,null,null,null,null,null,null,null,null,null,null,null,null,null,null,null,null,null,null,0,0,0,0,null,null,null,null,{"$f":"IF(AND(D74<>0,AH74=\"\"),1,IF(AND(E74<>0,AI74=\"\"),1,0))","v":0},{"$f":"IF(AND(D74<>0,AJ74=\"\"),1,IF(AND(E74<>0,AK74=\"\"),1,0))","v":0}]
["ANTECEDENTES DE INFARTO AGUDO AL MIOCARDIO",null,0,0,0,null,null,null,null,null,null,null,null,null,null,null,null,null,null,null,null,null,null,null,null,null,null,null,null,null,null,null,null,null,null,null,null,"",null,null,null,null,null,null,null,null,null,null,null,null,null,null,null,null,null,{"$f":"IF($D72>=$AH72,\"\",CONCATENATE(\"* Pueblos Originarios-Hombres no debe ser mayor al Total de personas \",A72,\".\"))","v":""},{"$f":"IF($E72>=$AI72,\"\",CONCATENATE(\"* Pueblos Originarios-Mujeres no debe ser mayor al Total de personas \",A72,\".\"))","v":""},{"$f":"IF($D72>=$AJ72,\"\",CONCATENATE(\"* Población Migrante-Hombres no debe ser mayor al Total de personas \",A72,\".\"))","v":""},{"$f":"IF($E72>=$AK72,\"\",CONCATENATE(\"* Población Migrante - Mujeres no debe ser mayor al Total de personas \",A72,\".\"))","v":""},null,null,{"$f":"IF(AND(D72<>0,AH72=\"\"),\"* No olvide escribir en la celda de 'Pueblos Originarios' (Digite CERO si no tiene). \",IF(AND(E72<>0,AI72=\"\"),\"* No olvide escribir en la celda de 'Pueblos Originarios' (Digite CERO si no tiene). \",\"\"))","v":""},{"$f":"IF(AND(D72<>0,AJ72=\"\"),\"* No olvide escribir en la celda de 'Población Migrantes' (Digite CERO si no tiene). \",IF(AND(E72<>0,AK72=\"\"),\"* No olvide escribir en la celda de 'Población Migrantes' (Digite CERO si no tiene). \",\"\"))","v":""},null,null,null,null,null,null,null,null,null,null,null,null,null,null,null,null,null,null,null,null,null,null,null,null,null,null,null,null,0,0,0,0,null,null,null,null,{"$f":"IF(AND(D75<>0,AH75=\"\"),1,IF(AND(E75<>0,AI75=\"\"),1,0))","v":0},{"$f":"IF(AND(D75<>0,AJ75=\"\"),1,IF(AND(E75<>0,AK75=\"\"),1,0))","v":0}]
["RETINOPATÍA DIABETICA",null,{"$f":"SUM(D73:E73)","v":0},{"$f":"+F73+H73+J73+L73+N73+P73+R73+T73+V73+X73+Z73+AB73+AD73+AF73","v":0},{"$f":"+G73+I73+K73+M73+O73+Q73+S73+U73+W73+Y73+AA73+AC73+AE73+AG73","v":0}]
["PERSONAS CON HIPERTENSION EN PSCV"]
["CON RAZON ALBÚMINA CREATININA (RAC),VIGENTE",null,{"$f":"SUM(D75:E75)","v":0},{"$f":"+F75+H75+J75+L75+N75+P75+R75+T75+V75+X75+Z75+AB75+AD75+AF75","v":0},{"$f":"+G75+I75+K75+M75+O75+Q75+S75+U75+W75+Y75+AA75+AC75+AE75+AG75","v":0},null,null,null,null,null,null,null,null,null,null,null,null,null,null,null,null,null,null,null,null,null,null,null,null,null,null,null,null,null,null,null,null,"",null,null,null,null,null,null,null,null,null,null,null,null,null,null,null,null,null,{"$f":"IF($D75>=$AH75,\"\",CONCATENATE(\"* Pueblos Originarios-Hombres no debe ser mayor al Total de personas \",A75,\".\"))","v":""},{"$f":"IF($E75>=$AI75,\"\",CONCATENATE(\"* Pueblos Originarios-Mujeres no debe ser mayor al Total de personas \",A75,\".\"))","v":""},{"$f":"IF($D75>=$AJ75,\"\",CONCATENATE(\"* Población Migrante-Hombres no debe ser mayor al Total de personas \",A75,\".\"))","v":""},{"$f":"IF($E75>=$AK75,\"\",CONCATENATE(\"* Población Migrante - Mujeres no debe ser mayor al Total de personas \",A75,\".\"))","v":""},null,null,{"$f":"IF(AND(D75<>0,AH75=\"\"),\"* No olvide escribir en la celda de 'Pueblos Originarios' (Digite CERO si no tiene). \",IF(AND(E75<>0,AI75=\"\"),\"* No olvide escribir en la celda de 'Pueblos Originarios' (Digite CERO si no tiene). \",\"\"))","v":""},{"$f":"IF(AND(D75<>0,AJ75=\"\"),\"* No olvide escribir en la celda de 'Población Migrantes' (Digite CERO si no tiene). \",IF(AND(E75<>0,AK75=\"\"),\"* No olvide escribir en la celda de 'Población Migrantes' (Digite CERO si no tiene). \",\"\"))","v":""},null,null,null,null,null,null,null,null,null,null,null,null,null,null,null,null,null,null,null,null,null,null,null,null,null,null,null,null,0,0,0,0,null,null,null,null,{"$f":"IF(AND(D78<>0,AH78=\"\"),1,IF(AND(E78<>0,AI78=\"\"),1,0))","v":0},{"$f":"IF(AND(D78<>0,AJ78=\"\"),1,IF(AND(E78<>0,AK78=\"\"),1,0))","v":0}]
["CON VELOCIDAD DE FILTRACIÓN GLOMERULAR ESTIMADA (VFGe) Y CON RAZON ALBÚMINA CREATININA  (RAC) VIGENTE",null,{"$f":"SUM(D76:E76)","v":0},0,0]
["CON PRESIÓN ARTERIAL igual o Mayor 160/100 mmHg",null,0,0,0,null,null,null,null,null,null,null,null,null,null,null,null,null,null,null,null,null,null,null,null,null,null,null,null,null,null,null,null,null,null,null,null,"",null,null,null,null,null,null,null,null,null,null,null,null,null,null,null,null,null,{"$f":"IF($D77>=$AH77,\"\",CONCATENATE(\"* Pueblos Originarios-Hombres no debe ser mayor al Total de personas \",A77,\".\"))","v":""},{"$f":"IF($E77>=$AI77,\"\",CONCATENATE(\"* Pueblos Originarios-Mujeres no debe ser mayor al Total de personas \",A77,\".\"))","v":""},{"$f":"IF($D77>=$AJ77,\"\",CONCATENATE(\"* Población Migrante-Hombres no debe ser mayor al Total de personas \",A77,\".\"))","v":""},{"$f":"IF($E77>=$AK77,\"\",CONCATENATE(\"* Población Migrante - Mujeres no debe ser mayor al Total de personas \",A77,\".\"))","v":""},null,null,"","",null,null,null,null,null,null,null,null,null,null,null,null,null,null,null,null,null,null,null,null,null,null,null,null,null,null,null,null,0,0,0,0,null,null,null,null,{"$f":"IF(AND(D80<>0,AH80=\"\"),1,IF(AND(E80<>0,AI80=\"\"),1,0))","v":0},{"$f":"IF(AND(D80<>0,AJ80=\"\"),1,IF(AND(E80<>0,AK80=\"\"),1,0))","v":0}]
["CON VELOCIDAD DE FILTRACION GLOMERULAR  ESTIMADA  (VFGe) VIGENTE",null,0,0,0,null,null,null,null,null,null,null,null,null,null,null,null,null,null,null,null,null,null,null,null,null,null,null,null,null,null,null,null,null,null,null,null,"",null,null,null,null,null,null,null,null,null,null,null,null,null,null,null,null,null,{"$f":"IF($D78>=$AH78,\"\",CONCATENATE(\"* Pueblos Originarios-Hombres no debe ser mayor al Total de personas \",A78,\".\"))","v":""},{"$f":"IF($E78>=$AI78,\"\",CONCATENATE(\"* Pueblos Originarios-Mujeres no debe ser mayor al Total de personas \",A78,\".\"))","v":""},{"$f":"IF($D78>=$AJ78,\"\",CONCATENATE(\"* Población Migrante-Hombres no debe ser mayor al Total de personas \",A78,\".\"))","v":""},{"$f":"IF($E78>=$AK78,\"\",CONCATENATE(\"* Población Migrante - Mujeres no debe ser mayor al Total de personas \",A78,\".\"))","v":""},null,null,"","",null,null,null,null,null,null,null,null,null,null,null,null,null,null,null,null,null,null,null,null,null,null,null,null,null,null,null,null,0,0,0,0,null,null,null,null,0,0]
["PROTOCOLO HEARTS",null,{"$f":"SUM(D79:E79)","v":0},{"$f":"+F79+H79+J79+L79+N79+P79+R79+T79+V79+X79+Z79+AB79+AD79+AF79","v":0},{"$f":"+G79+I79+K79+M79+O79+Q79+S79+U79+W79+Y79+AA79+AC79+AE79+AG79","v":0}]
["TODAS LAS PERSONAS EN PSCV"]
["SOBREPESO: IMC entre 25 y 29.9 <65",null,{"$f":"SUM(D81:E81)","v":0},{"$f":"+F81+H81+J81+L81+N81+P81+R81+T81+V81+X81","v":0},{"$f":"+G81+I81+K81+M81+O81+Q81+S81+U81+W81+Y81","v":0},null,null,null,null,null,null,null,null,null,null,null,null,null,null,null,null,null,null,null,null,null,null,null,null,null,null,null,null,null,null,null,null,"",null,null,null,null,null,null,null,null,null,null,null,null,null,null,null,null,null,{"$f":"IF($D81>=$AH81,\"\",CONCATENATE(\"* Pueblos Originarios-Hombres no debe ser mayor al Total de personas \",A81,\".\"))","v":""},{"$f":"IF($E81>=$AI81,\"\",CONCATENATE(\"* Pueblos Originarios-Mujeres no debe ser mayor al Total de personas \",A81,\".\"))","v":""},{"$f":"IF($D81>=$AJ81,\"\",CONCATENATE(\"* Población Migrante-Hombres no debe ser mayor al Total de personas \",A81,\".\"))","v":""},{"$f":"IF($E81>=$AK81,\"\",CONCATENATE(\"* Población Migrante - Mujeres no debe ser mayor al Total de personas \",A81,\".\"))","v":""},null,null,{"$f":"IF(AND(D81<>0,AH81=\"\"),\"* No olvide escribir en la celda de 'Pueblos Originarios' (Digite CERO si no tiene). \",IF(AND(E81<>0,AI81=\"\"),\"* No olvide escribir en la celda de 'Pueblos Originarios' (Digite CERO si no tiene). \",\"\"))","v":""},{"$f":"IF(AND(D81<>0,AJ81=\"\"),\"* No olvide escribir en la celda de 'Población Migrantes' (Digite CERO si no tiene). \",IF(AND(E81<>0,AK81=\"\"),\"* No olvide escribir en la celda de 'Población Migrantes' (Digite CERO si no tiene). \",\"\"))","v":""},null,null,null,null,null,null,null,null,null,null,null,null,null,null,null,null,null,null,null,null,null,null,null,null,null,null,null,null,0,0,0,0,null,null,null,null,{"$f":"IF(AND(D83<>0,AH83=\"\"),1,IF(AND(E83<>0,AI83=\"\"),1,0))","v":0},{"$f":"IF(AND(D83<>0,AJ83=\"\"),1,IF(AND(E83<>0,AK83=\"\"),1,0))","v":0}]
["SOBREPESO: IMC entre 28 y 31.9 >65",null,0,{"$f":"+Z82+AB82+AD82+AF82","v":0},{"$f":"+AA82+AC82+AE82+AG82","v":0},null,null,null,null,null,null,null,null,null,null,null,null,null,null,null,null,null,null,null,null,null,null,null,null,null,null,null,null,null,null,null,null,"",null,null,null,null,null,null,null,null,null,null,null,null,null,null,null,null,null,{"$f":"IF($D82>=$AH82,\"\",CONCATENATE(\"* Pueblos Originarios-Hombres no debe ser mayor al Total de personas \",A82,\".\"))","v":""},{"$f":"IF($E82>=$AI82,\"\",CONCATENATE(\"* Pueblos Originarios-Mujeres no debe ser mayor al Total de personas \",A82,\".\"))","v":""},{"$f":"IF($D82>=$AJ82,\"\",CONCATENATE(\"* Población Migrante-Hombres no debe ser mayor al Total de personas \",A82,\".\"))","v":""},{"$f":"IF($E82>=$AK82,\"\",CONCATENATE(\"* Población Migrante - Mujeres no debe ser mayor al Total de personas \",A82,\".\"))","v":""},null,null,"","",null,null,null,null,null,null,null,null,null,null,null,null,null,null,null,null,null,null,null,null,null,null,null,null,null,null,null,null,0,0,0,0,null,null,null,null,0,0]
["OBESIDAD: IMC igual o Mayor a 30KG/M2 <65",null,0,{"$f":"+F83+H83+J83+L83+N83+P83+R83+T83+V83+X83","v":0},{"$f":"+G83+I83+K83+M83+O83+Q83+S83+U83+W83+Y83","v":0},null,null,null,null,null,null,null,null,null,null,null,null,null,null,null,null,null,null,null,null,null,null,null,null,null,null,null,null,null,null,null,null,"",null,null,null,null,null,null,null,null,null,null,null,null,null,null,null,null,null,{"$f":"IF($D83>=$AH83,\"\",CONCATENATE(\"* Pueblos Originarios-Hombres no debe ser mayor al Total de personas \",A83,\".\"))","v":""},{"$f":"IF($E83>=$AI83,\"\",CONCATENATE(\"* Pueblos Originarios-Mujeres no debe ser mayor al Total de personas \",A83,\".\"))","v":""},{"$f":"IF($D83>=$AJ83,\"\",CONCATENATE(\"* Población Migrante-Hombres no debe ser mayor al Total de personas \",A83,\".\"))","v":""},{"$f":"IF($E83>=$AK83,\"\",CONCATENATE(\"* Población Migrante - Mujeres no debe ser mayor al Total de personas \",A83,\".\"))","v":""},null,null,"","",null,null,null,null,null,null,null,null,null,null,null,null,null,null,null,null,null,null,null,null,null,null,null,null,null,null,null,null,0,0,0,0,null,null,null,null,0,0]
["OBESIDAD: IMC igual o Mayor a 32KG/M2 >65",null,0,{"$f":"+Z84+AB84+AD84+AF84","v":0},{"$f":"+AA84+AC84+AE84+AG84","v":0},null,null,null,null,null,null,null,null,null,null,null,null,null,null,null,null,null,null,null,null,null,null,null,null,null,null,null,null,null,null,null,null,"",null,null,null,null,null,null,null,null,null,null,null,null,null,null,null,null,null,{"$f":"IF($D84>=$AH84,\"\",CONCATENATE(\"* Pueblos Originarios-Hombres no debe ser mayor al Total de personas \",A84,\".\"))","v":""},{"$f":"IF($E84>=$AI84,\"\",CONCATENATE(\"* Pueblos Originarios-Mujeres no debe ser mayor al Total de personas \",A84,\".\"))","v":""},{"$f":"IF($D84>=$AJ84,\"\",CONCATENATE(\"* Población Migrante-Hombres no debe ser mayor al Total de personas \",A84,\".\"))","v":""},{"$f":"IF($E84>=$AK84,\"\",CONCATENATE(\"* Población Migrante - Mujeres no debe ser mayor al Total de personas \",A84,\".\"))","v":""},null,null,"","",null,null,null,null,null,null,null,null,null,null,null,null,null,null,null,null,null,null,null,null,null,null,null,null,null,null,null,null,0,0,0,0,null,null,null,null,0,0]
["NOTA (*): La vigencia de la evaluación del pie diabético es de 12 meses."]
[]
[]
[]
[]
[]
[]
[]
[]
[]
[]
[]
[]
[]
[{"$f":"SUM(C12:AL29,C34:AK42,C48:C72,C75:C78,C81:C84)","v":0},"datos"]
[{"$f":"SUM(CL13:DS93)","v":0},"errores"]

{"sheet":"P5","index":5,"n_rows":82,"n_cols":53,"rows_kept":82,"cut":false,"hidden":false,"merged":[[30,25,31,26],[30,51,31,52],[39,25,40,26],[44,25,45,26],[49,25,50,26],[49,21,50,22],[49,23,50,24],[40,15,40,16],[40,17,40,18],[40,19,40,20],[50,13,50,14],[39,21,40,22],[39,23,40,24],[45,13,45,14],[45,15,45,16],[45,17,45,18],[45,19,45,20],[44,5,44,20],[44,21,45,22],[44,23,45,24],[40,9,40,10],[23,19,23,20],[23,21,23,22],[22,5,22,22],[8,5,8,20],[22,25,23,26],[23,7,23,8],[23,9,23,10],[23,11,23,12],[23,13,23,14],[22,23,23,24],[8,21,9,22],[8,23,9,24],[9,5,9,6],[9,7,9,8],[9,9,9,10],[9,19,9,20],[30,44,31,45],[30,46,31,46],[30,47,31,47],[22,41,23,42],[22,43,23,44],[22,45,23,45],[22,46,23,46],[30,35,31,36],[30,37,31,38],[30,39,31,39],[30,40,31,40],[30,42,31,43],[22,34,23,35],[22,36,23,37],[22,38,23,38],[22,39,23,39],[6,4,6,17],[49,0,51,0],[45,5,45,6],[50,5,50,6],[50,9,50,10],[45,9,45,10],[45,11,45,12],[50,7,50,8],[40,11,40,12],[44,2,45,4],[39,0,41,1],[40,7,40,8],[8,2,9,4],[40,13,40,14],[8,25,9,26],[9,13,9,14],[9,11,9,12],[9,15,9,16],[9,17,9,18],[23,15,23,16],[39,2,40,4],[38,0,38,6],[47,0,47,1],[40,5,40,6],[42,0,42,1],[44,0,46,1],[55,0,56,0],[49,2,50,4],[52,0,54,0],[48,0,48,8],[43,0,43,7],[45,7,45,8],[39,5,39,20],[50,15,50,16],[50,17,50,18],[50,19,50,20],[50,11,50,12],[49,5,49,20],[49,1,51,1],[36,0,36,1],[37,0,37,1],[30,23,31,24],[30,21,31,22],[31,13,31,14],[23,5,23,6],[31,19,31,20],[31,7,31,8],[30,2,31,4],[30,0,32,1],[22,2,23,4],[31,9,31,10],[31,11,31,12],[31,15,31,16],[31,17,31,18],[30,5,30,20],[31,5,31,6],[33,0,33,1],[22,0,24,1],[25,0,25,1],[26,0,26,1],[27,0,27,1],[28,0,28,1],[23,17,23,18],[19,0,19,1],[20,0,20,1],[34,0,34,1],[35,0,35,1],[8,0,10,1],[11,0,11,1],[12,0,12,1],[13,0,13,1],[14,0,14,1],[15,0,15,1],[16,0,16,1],[17,0,17,1],[18,0,18,1]]}
["DATOS DEL ESTABLECIMIENTO"]
[{"$f":"CONCATENATE(\"COMUNA: \",NOMBRE!$B$2,\" - \",\"( \",NOMBRE!$C$2,NOMBRE!$D$2,NOMBRE!$E$2,NOMBRE!$F$2,NOMBRE!$G$2,\" )\")","v":"COMUNA:  - (  )"}]
[{"$f":"CONCATENATE(\"ESTABLECIMIENTO/ESTRATEGIA: \",NOMBRE!$B$3,\" - \",\"( \",NOMBRE!$C$3,NOMBRE!$D$3,NOMBRE!$E$3,NOMBRE!$F$3,NOMBRE!$G$3,NOMBRE!$H$3,\" )\")","v":"ESTABLECIMIENTO/ESTRATEGIA:  - (  )"}]
[{"$f":"CONCATENATE(\"MES: \",NOMBRE!$B$6,\" - \",\"( \",NOMBRE!$C$6,NOMBRE!$D$6,\" )\")","v":"MES:  - (  )"}]
[{"$f":"CONCATENATE(\"AÑO: \",NOMBRE!$B$7)","v":"AÑO: 2023"}]
[]
[null,null,null,null,"REM-P5. POBLACIÓN EN CONTROL PROGRAMA NACIONAL DE SALUD INTEGRAL DE PERSONAS MAYORES "]
["SECCION A: POBLACIÓN EN CONTROL POR CONDICIÓN DE FUNCIONALIDAD",null,null,null,null,null,null,null,null,null,null,null,null,null,null,null,null,null,null,null,null,null,null,null,null,null,null,null,null,"Pueblos Originarios",null,"Población Migrantes",null,"Pueblos Originarios","Población Migrantes",null,"Pueblos Originarios",null,"Población Migrantes",null,"Pueblos Originarios","Población Migrantes"]
["CONDICIÓN DE \nFUNCIONALIDAD",null,"TOTAL",null,null,"GRUPO DE EDAD (en años) Y SEXO",null,null,null,null,null,null,null,null,null,null,null,null,null,null,null,"Pueblos Originarios",null,"Población Migrantes",null,"Personas Mayores en ELEAM"]
[null,null,null,null,null,"65 a 69 años",null,"70 a 74 años",null,"75 a 79 años",null,"80 a 84 años",null,"85 a 89 años",null,"90 a 94 años",null,"95 a 99 años",null,"100 y mas años",null,null,null,null,null,null,null,null,null,null,null,null,null,null,null,null,"Hombres","Mujeres","Hombres","Mujeres","No Olvide","No Olvide",null,"Hombres","Mujeres","Hombres","Mujeres","No Olvide","No Olvide"]
[null,null,"Ambos\nsexos","Hombres","Mujeres","Hombres ","Mujeres","Hombres ","Mujeres","Hombres ","Mujeres","Hombres ","Mujeres","Hombres ","Mujeres","Hombres ","Mujeres","Hombres ","Mujeres","Hombres ","Mujeres","Hombres","Mujeres","Hombres","Mujeres","Hombres","Mujeres"]
["AUTOVALENTE SIN RIESGO",null,{"$f":"SUM(D12:E12)","v":0},{"$f":"+F12+H12+J12+L12+N12+P12+R12+T12","v":0},{"$f":"+G12+I12+K12+M12+O12+Q12+S12+U12","v":0},null,null,null,null,null,null,null,null,null,null,null,null,null,null,null,null,null,null,null,null,null,null,null,null,null,null,null,null,null,null,null,{"$f":"IF($D12>=$V12,\"\",\"* La celda 'Pueblos Originarios / Hombres' debe ser menor o igual al Total de Hombres en control. \")","v":""},{"$f":"IF($E12>=$W12,\"\",\"* La celda 'Pueblos Originarios / Mujeres' debe ser menor o igual al Total de Mujeres en control. \")","v":""},{"$f":"IF($D12>=$X12,\"\",\"* La celda 'Población Migrantes / Hombres' debe ser menor o igual al Total de Hombres en control. \")","v":""},{"$f":"IF($E12>=$Y12,\"\",\"* La celda 'Población Migrantes / Mujeres' debe ser menor o igual al Total de Mujeres en control. \")","v":""},{"$f":"IF(AND($D12<>0,$V12=\"\"),\"* No olvide escribir en las celdas de 'Pueblos Originarios' (Digite CERO si no tiene). \",IF(AND(E12<>0,W12=\"\"),\"* No olvide escribir en las celdas de 'Pueblos Originarios' (Digite CERO si no tiene). \",\"\"))","v":""},{"$f":"IF(AND($D12<>0,$X12=\"\"),\"* No olvide escribir en las celdas de 'Población Migrantes' (Digite CERO si no tiene). \",IF(AND(E12<>0,Y12=\"\"),\"* No olvide escribir en las celdas de 'Población Migrantes' (Digite CERO si no tiene). \",\"\"))","v":""},null,{"$f":"IF($D12>=$V12,0,1)","v":0},{"$f":"IF($E12>=$W12,0,1)","v":0},{"$f":"IF($D12>=$X12,0,1)","v":0},{"$f":"IF($E12>=$Y12,0,1)","v":0},{"$f":"IF(AND(D12<>0,V12=\"\"),1,IF(AND(E12<>0,W12=\"\"),1,0))","v":0},{"$f":"IF(AND(D12<>0,X12=\"\"),1,IF(AND(E12<>0,Y12=\"\"),1,0))","v":0}]
["AUTOVALENTE CON RIESGO",null,0,{"$f":"+F13+H13+J13+L13+N13+P13+R13+T13","v":0},{"$f":"+G13+I13+K13+M13+O13+Q13+S13+U13","v":0},null,null,null,null,null,null,null,null,null,null,null,null,null,null,null,null,null,null,null,null,null,null,null,null,null,null,null,null,null,null,null,{"$f":"IF($D13>=$V13,\"\",\"* La celda 'Pueblos Originarios / Hombres' debe ser menor o igual al Total de Hombres en control. \")","v":""},{"$f":"IF($E13>=$W13,\"\",\"* La celda 'Pueblos Originarios / Mujeres' debe ser menor o igual al Total de Mujeres en control. \")","v":""},{"$f":"IF($D13>=$X13,\"\",\"* La celda 'Población Migrantes / Hombres' debe ser menor o igual al Total de Hombres en control. \")","v":""},{"$f":"IF($E13>=$Y13,\"\",\"* La celda 'Población Migrantes / Mujeres' debe ser menor o igual al Total de Mujeres en control. \")","v":""},{"$f":"IF(AND($D13<>0,$V13=\"\"),\"* No olvide escribir en las celdas de 'Pueblos Originarios' (Digite CERO si no tiene). \",IF(AND(E13<>0,W13=\"\"),\"* No olvide escribir en las celdas de 'Pueblos Originarios' (Digite CERO si no tiene). \",\"\"))","v":""},{"$f":"IF(AND($D13<>0,$X13=\"\"),\"* No olvide escribir en las celdas de 'Población Migrantes' (Digite CERO si no tiene). \",IF(AND(E13<>0,Y13=\"\"),\"* No olvide escribir en las celdas de 'Población Migrantes' (Digite CERO si no tiene). \",\"\"))","v":""},null,{"$f":"IF($D13>=$V13,0,1)","v":0},{"$f":"IF($E13>=$W13,0,1)","v":0},{"$f":"IF($D13>=$X13,0,1)","v":0},{"$f":"IF($E13>=$Y13,0,1)","v":0},{"$f":"IF(AND(D13<>0,V13=\"\"),1,IF(AND(E13<>0,W13=\"\"),1,0))","v":0},{"$f":"IF(AND(D13<>0,X13=\"\"),1,IF(AND(E13<>0,Y13=\"\"),1,0))","v":0}]
["RIESGO DE DEPENDENCIA ",null,0,0,0,null,null,null,null,null,null,null,null,null,null,null,null,null,null,null,null,null,null,null,null,null,null,null,null,null,null,null,null,null,null,null,{"$f":"IF($D14>=$V14,\"\",\"* La celda 'Pueblos Originarios / Hombres' debe ser menor o igual al Total de Hombres en control. \")","v":""},{"$f":"IF($E14>=$W14,\"\",\"* La celda 'Pueblos Originarios / Mujeres' debe ser menor o igual al Total de Mujeres en control. \")","v":""},{"$f":"IF($D14>=$X14,\"\",\"* La celda 'Población Migrantes / Hombres' debe ser menor o igual al Total de Hombres en control. \")","v":""},{"$f":"IF($E14>=$Y14,\"\",\"* La celda 'Población Migrantes / Mujeres' debe ser menor o igual al Total de Mujeres en control. \")","v":""},{"$f":"IF(AND($D14<>0,$V14=\"\"),\"* No olvide escribir en las celdas de 'Pueblos Originarios' (Digite CERO si no tiene). \",IF(AND(E14<>0,W14=\"\"),\"* No olvide escribir en las celdas de 'Pueblos Originarios' (Digite CERO si no tiene). \",\"\"))","v":""},{"$f":"IF(AND($D14<>0,$X14=\"\"),\"* No olvide escribir en las celdas de 'Población Migrantes' (Digite CERO si no tiene). \",IF(AND(E14<>0,Y14=\"\"),\"* No olvide escribir en las celdas de 'Población Migrantes' (Digite CERO si no tiene). \",\"\"))","v":""},null,{"$f":"IF($D14>=$V14,0,1)","v":0},{"$f":"IF($E14>=$W14,0,1)","v":0},{"$f":"IF($D14>=$X14,0,1)","v":0},{"$f":"IF($E14>=$Y14,0,1)","v":0},{"$f":"IF(AND(D14<>0,V14=\"\"),1,IF(AND(E14<>0,W14=\"\"),1,0))","v":0},{"$f":"IF(AND(D14<>0,X14=\"\"),1,IF(AND(E14<>0,Y14=\"\"),1,0))","v":0}]
["SUBTOTAL (EFAM)",null,{"$f":"SUM(D15:E15)","v":0},{"$f":"+F15+H15+J15+L15+N15+P15+R15+T15","v":0},{"$f":"+G15+I15+K15+M15+O15+Q15+S15+U15","v":0},{"$f":"SUM(F12:F14)","v":0},{"$f":"SUM(G12:G14)","v":0},0,0,0,0,0,0,{"$f":"SUM(N12:N14)","v":0},0,{"$f":"SUM(P12:P14)","v":0},0,{"$f":"SUM(R12:R14)","v":0},0,0,0,{"$f":"SUM(V12:V14)","v":0},{"$f":"SUM(W12:W14)","v":0},0,{"$f":"SUM(Y12:Y14)","v":0},{"$f":"SUM(Z12:Z14)","v":0},{"$f":"SUM(AA12:AA14)","v":0}]
["DEPENDIENTE LEVE",null,0,{"$f":"+F16+H16+J16+L16+N16+P16+R16+T16","v":0},{"$f":"+G16+I16+K16+M16+O16+Q16+S16+U16","v":0},null,null,null,null,null,null,null,null,null,null,null,null,null,null,null,null,null,null,null,null,null,null,null,null,null,null,null,null,null,null,null,{"$f":"IF($D16>=$V16,\"\",\"* La celda 'Pueblos Originarios / Hombres' debe ser menor o igual al Total de Hombres en control. \")","v":""},{"$f":"IF($E16>=$W16,\"\",\"* La celda 'Pueblos Originarios / Mujeres' debe ser menor o igual al Total de Mujeres en control. \")","v":""},{"$f":"IF($D16>=$X16,\"\",\"* La celda 'Población Migrantes / Hombres' debe ser menor o igual al Total de Hombres en control. \")","v":""},{"$f":"IF($E16>=$Y16,\"\",\"* La celda 'Población Migrantes / Mujeres' debe ser menor o igual al Total de Mujeres en control. \")","v":""},{"$f":"IF(AND($D16<>0,$V16=\"\"),\"* No olvide escribir en las celdas de 'Pueblos Originarios' (Digite CERO si no tiene). \",IF(AND(E16<>0,W16=\"\"),\"* No olvide escribir en las celdas de 'Pueblos Originarios' (Digite CERO si no tiene). \",\"\"))","v":""},{"$f":"IF(AND($D16<>0,$X16=\"\"),\"* No olvide escribir en las celdas de 'Población Migrantes' (Digite CERO si no tiene). \",IF(AND(E16<>0,Y16=\"\"),\"* No olvide escribir en las celdas de 'Población Migrantes' (Digite CERO si no tiene). \",\"\"))","v":""},null,{"$f":"IF($D16>=$V16,0,1)","v":0},{"$f":"IF($E16>=$W16,0,1)","v":0},{"$f":"IF($D16>=$X16,0,1)","v":0},{"$f":"IF($E16>=$Y16,0,1)","v":0},{"$f":"IF(AND(D16<>0,V16=\"\"),1,IF(AND(E16<>0,W16=\"\"),1,0))","v":0},{"$f":"IF(AND(D16<>0,X16=\"\"),1,IF(AND(E16<>0,Y16=\"\"),1,0))","v":0}]
["DEPENDIENTE MODERADO ",null,0,{"$f":"+F17+H17+J17+L17+N17+P17+R17+T17","v":0},0,null,null,null,null,null,null,null,null,null,null,null,null,null,null,null,null,null,null,null,null,null,null,null,null,null,null,null,null,null,null,null,{"$f":"IF($D17>=$V17,\"\",\"* La celda 'Pueblos Originarios / Hombres' debe ser menor o igual al Total de Hombres en control. \")","v":""},{"$f":"IF($E17>=$W17,\"\",\"* La celda 'Pueblos Originarios / Mujeres' debe ser menor o igual al Total de Mujeres en control. \")","v":""},{"$f":"IF($D17>=$X17,\"\",\"* La celda 'Población Migrantes / Hombres' debe ser menor o igual al Total de Hombres en control. \")","v":""},{"$f":"IF($E17>=$Y17,\"\",\"* La celda 'Población Migrantes / Mujeres' debe ser menor o igual al Total de Mujeres en control. \")","v":""},{"$f":"IF(AND($D17<>0,$V17=\"\"),\"* No olvide escribir en las celdas de 'Pueblos Originarios' (Digite CERO si no tiene). \",IF(AND(E17<>0,W17=\"\"),\"* No olvide escribir en las celdas de 'Pueblos Originarios' (Digite CERO si no tiene). \",\"\"))","v":""},{"$f":"IF(AND($D17<>0,$X17=\"\"),\"* No olvide escribir en las celdas de 'Población Migrantes' (Digite CERO si no tiene). \",IF(AND(E17<>0,Y17=\"\"),\"* No olvide escribir en las celdas de 'Población Migrantes' (Digite CERO si no tiene). \",\"\"))","v":""},null,{"$f":"IF($D17>=$V17,0,1)","v":0},{"$f":"IF($E17>=$W17,0,1)","v":0},{"$f":"IF($D17>=$X17,0,1)","v":0},{"$f":"IF($E17>=$Y17,0,1)","v":0},{"$f":"IF(AND(D17<>0,V17=\"\"),1,IF(AND(E17<>0,W17=\"\"),1,0))","v":0},{"$f":"IF(AND(D17<>0,X17=\"\"),1,IF(AND(E17<>0,Y17=\"\"),1,0))","v":0}]
["DEPENDIENTE GRAVE ",null,0,0,0,null,null,null,null,null,null,null,null,null,null,null,null,null,null,null,null,null,null,null,null,null,null,null,null,null,null,null,null,null,null,null,{"$f":"IF($D18>=$V18,\"\",\"* La celda 'Pueblos Originarios / Hombres' debe ser menor o igual al Total de Hombres en control. \")","v":""},{"$f":"IF($E18>=$W18,\"\",\"* La celda 'Pueblos Originarios / Mujeres' debe ser menor o igual al Total de Mujeres en control. \")","v":""},{"$f":"IF($D18>=$X18,\"\",\"* La celda 'Población Migrantes / Hombres' debe ser menor o igual al Total de Hombres en control. \")","v":""},{"$f":"IF($E18>=$Y18,\"\",\"* La celda 'Población Migrantes / Mujeres' debe ser menor o igual al Total de Mujeres en control. \")","v":""},{"$f":"IF(AND($D18<>0,$V18=\"\"),\"* No olvide escribir en las celdas de 'Pueblos Originarios' (Digite CERO si no tiene). \",IF(AND(E18<>0,W18=\"\"),\"* No olvide escribir en las celdas de 'Pueblos Originarios' (Digite CERO si no tiene). \",\"\"))","v":""},{"$f":"IF(AND($D18<>0,$X18=\"\"),\"* No olvide escribir en las celdas de 'Población Migrantes' (Digite CERO si no tiene). \",IF(AND(E18<>0,Y18=\"\"),\"* No olvide escribir en las celdas de 'Población Migrantes' (Digite CERO si no tiene). \",\"\"))","v":""},null,{"$f":"IF($D18>=$V18,0,1)","v":0},{"$f":"IF($E18>=$W18,0,1)","v":0},{"$f":"IF($D18>=$X18,0,1)","v":0},{"$f":"IF($E18>=$Y18,0,1)","v":0},{"$f":"IF(AND(D18<>0,V18=\"\"),1,IF(AND(E18<>0,W18=\"\"),1,0))","v":0},{"$f":"IF(AND(D18<>0,X18=\"\"),1,IF(AND(E18<>0,Y18=\"\"),1,0))","v":0}]
["DEPENDIENTE TOTAL",null,0,{"$f":"+F19+H19+J19+L19+N19+P19+R19+T19","v":0},0,null,null,null,null,null,null,null,null,null,null,null,null,null,null,null,null,null,null,null,null,null,null,null,null,null,null,null,null,null,null,null,{"$f":"IF($D19>=$V19,\"\",\"* La celda 'Pueblos Originarios / Hombres' debe ser menor o igual al Total de Hombres en control. \")","v":""},{"$f":"IF($E19>=$W19,\"\",\"* La celda 'Pueblos Originarios / Mujeres' debe ser menor o igual al Total de Mujeres en control. \")","v":""},{"$f":"IF($D19>=$X19,\"\",\"* La celda 'Población Migrantes / Hombres' debe ser menor o igual al Total de Hombres en control. \")","v":""},{"$f":"IF($E19>=$Y19,\"\",\"* La celda 'Población Migrantes / Mujeres' debe ser menor o igual al Total de Mujeres en control. \")","v":""},{"$f":"IF(AND($D19<>0,$V19=\"\"),\"* No olvide escribir en las celdas de 'Pueblos Originarios' (Digite CERO si no tiene). \",IF(AND(E19<>0,W19=\"\"),\"* No olvide escribir en las celdas de 'Pueblos Originarios' (Digite CERO si no tiene). \",\"\"))","v":""},{"$f":"IF(AND($D19<>0,$X19=\"\"),\"* No olvide escribir en las celdas de 'Población Migrantes' (Digite CERO si no tiene). \",IF(AND(E19<>0,Y19=\"\"),\"* No olvide escribir en las celdas de 'Población Migrantes' (Digite CERO si no tiene). \",\"\"))","v":""},null,{"$f":"IF($D19>=$V19,0,1)","v":0},{"$f":"IF($E19>=$W19,0,1)","v":0},{"$f":"IF($D19>=$X19,0,1)","v":0},{"$f":"IF($E19>=$Y19,0,1)","v":0},{"$f":"IF(AND(D19<>0,V19=\"\"),1,IF(AND(E19<>0,W19=\"\"),1,0))","v":0},{"$f":"IF(AND(D19<>0,X19=\"\"),1,IF(AND(E19<>0,Y19=\"\"),1,0))","v":0}]
["SUBTOTAL (INDICE BARTHEL)",null,{"$f":"SUM(D20:E20)","v":0},{"$f":"+F20+H20+J20+L20+N20+P20+R20+T20","v":0},{"$f":"+G20+I20+K20+M20+O20+Q20+S20+U20","v":0},{"$f":"SUM(F16:F19)","v":0},{"$f":"SUM(G16:G19)","v":0},0,0,0,0,0,0,{"$f":"SUM(N16:N19)","v":0},0,{"$f":"SUM(P16:P19)","v":0},0,{"$f":"SUM(R16:R19)","v":0},0,0,0,{"$f":"SUM(V16:V19)","v":0},{"$f":"SUM(W16:W19)","v":0},0,{"$f":"SUM(Y16:Y19)","v":0},{"$f":"SUM(Z16:Z19)","v":0},{"$f":"SUM(AA16:AA19)","v":0}]
["TOTAL PERSONAS MAYORES EN CONTROL",null,0,{"$f":"+F21+H21+J21+L21+N21+P21+R21+T21","v":0},{"$f":"+G21+I21+K21+M21+O21+Q21+S21+U21","v":0},{"$f":"+F15+F20","v":0},{"$f":"+G15+G20","v":0},0,0,0,0,0,0,{"$f":"+N15+N20","v":0},0,{"$f":"+P15+P20","v":0},0,{"$f":"+R15+R20","v":0},0,0,0,{"$f":"+V15+V20","v":0},{"$f":"+W15+W20","v":0},0,{"$f":"+Y15+Y20","v":0},{"$f":"+Z15+Z20","v":0},{"$f":"+AA15+AA20","v":0}]
["SECCION A.1: EXISTENCIA DE POBLACIÓN EN CONTROL EN PROGRAMA \"MÁS ADULTOS MAYORES AUTOVALENTES\" POR CONDICIÓN DE FUNCIONALIDAD"]
["CONDICIÓN DE \nFUNCIONALIDAD",null,"TOTAL",null,null,"GRUPO DE EDAD (en años) Y SEXO",null,null,null,null,null,null,null,null,null,null,null,null,null,null,null,null,null,"Pueblos Originarios",null,"Población Migrantes",null,null,null,null,null,null,null,null,"Pueblos Originarios",null,"Población Migrantes",null,"Pueblos Originarios","Población Migrantes",null,"Pueblos Originarios",null,"Población Migrantes",null,"Pueblos Originarios","Población Migrantes"]
[null,null,null,null,null,"60 a 64 años",null,"65 a 69 años",null,"70 a 74 años",null,"75 a 79 años",null,"80 a 84 años",null,"85 a 89 años",null,"90 a 94 años",null,"95 a 99 años",null,"100 y mas años"]
[null,null,"Ambos\nsexos","Hombres","Mujeres","Hombres ","Mujeres","Hombres ","Mujeres","Hombres ","Mujeres","Hombres ","Mujeres","Hombres ","Mujeres","Hombres ","Mujeres","Hombres ","Mujeres","Hombres ","Mujeres","Hombres ","Mujeres","Hombres","Mujeres","Hombres","Mujeres",null,null,null,null,null,null,null,"Hombres","Mujeres","Hombres","Mujeres","No Olvide","No Olvide",null,"Hombres","Mujeres","Hombres","Mujeres","No Olvide","No Olvide"]
["AUTOVALENTE SIN RIESGO",null,{"$f":"SUM(D26:E26)","v":0},{"$f":"+F26+H26+J26+L26+N26+P26+R26+T26+V26","v":0},{"$f":"+G26+I26+K26+M26+O26+Q26+S26+U26+W26","v":0},null,null,null,null,null,null,null,null,null,null,null,null,null,null,null,null,null,null,null,null,null,null,null,null,null,null,null,null,null,{"$f":"IF($D26>=$X26,\"\",\"* La celda 'Pueblos Originarios / Hombres' debe ser menor o igual al Total de Hombres en control. \")","v":""},{"$f":"IF($E26>=$Y26,\"\",\"* La celda 'Pueblos Originarios / Mujeres' debe ser menor o igual al Total de Mujeres en control. \")","v":""},{"$f":"IF($D26>=$Z26,\"\",\"* La celda 'Población Migrantes / Hombres' debe ser menor o igual al Total de Hombres en control. \")","v":""},{"$f":"IF($E26>=$AA26,\"\",\"* La celda 'Población Migrantes / Mujeres' debe ser menor o igual al Total de Mujeres en control. \")","v":""},{"$f":"IF(AND($D26<>0,$X26=\"\"),\"* No olvide escribir en las celdas de 'Pueblos Originarios' (Digite CERO si no tiene). \",IF(AND(E26<>0,Y26=\"\"),\"* No olvide escribir en las celdas de 'Pueblos Originarios' (Digite CERO si no tiene). \",\"\"))","v":""},{"$f":"IF(AND($D26<>0,$Z26=\"\"),\"* No olvide escribir en las celdas de 'Población Migrantes' (Digite CERO si no tiene). \",IF(AND(E26<>0,AA26=\"\"),\"* No olvide escribir en las celdas de 'Población Migrantes' (Digite CERO si no tiene). \",\"\"))","v":""},null,{"$f":"IF($D26>=$X26,0,1)","v":0},{"$f":"IF($E26>=$Y26,0,1)","v":0},{"$f":"IF($D26>=$Z26,0,1)","v":0},{"$f":"IF($E26>=$AA26,0,1)","v":0},{"$f":"IF(AND(D26<>0,X26=\"\"),1,IF(AND(E26<>0,Y26=\"\"),1,0))","v":0},{"$f":"IF(AND(D26<>0,Z26=\"\"),1,IF(AND(E26<>0,AA26=\"\"),1,0))","v":0}]
["AUTOVALENTE CON RIESGO",null,{"$f":"SUM(D27:E27)","v":0},{"$f":"+F27+H27+J27+L27+N27+P27+R27+T27+V27","v":0},{"$f":"+G27+I27+K27+M27+O27+Q27+S27+U27+W27","v":0},null,null,null,null,null,null,null,null,null,null,null,null,null,null,null,null,null,null,null,null,null,null,null,null,null,null,null,null,null,{"$f":"IF($D27>=$X27,\"\",\"* La celda 'Pueblos Originarios / Hombres' debe ser menor o igual al Total de Hombres en control. \")","v":""},{"$f":"IF($E27>=$Y27,\"\",\"* La celda 'Pueblos Originarios / Mujeres' debe ser menor o igual al Total de Mujeres en control. \")","v":""},{"$f":"IF($D27>=$Z27,\"\",\"* La celda 'Población Migrantes / Hombres' debe ser menor o igual al Total de Hombres en control. \")","v":""},{"$f":"IF($E27>=$AA27,\"\",\"* La celda 'Población Migrantes / Mujeres' debe ser menor o igual al Total de Mujeres en control. \")","v":""},{"$f":"IF(AND($D27<>0,$X27=\"\"),\"* No olvide escribir en las celdas de 'Pueblos Originarios' (Digite CERO si no tiene). \",IF(AND(E27<>0,Y27=\"\"),\"* No olvide escribir en las celdas de 'Pueblos Originarios' (Digite CERO si no tiene). \",\"\"))","v":""},{"$f":"IF(AND($D27<>0,$Z27=\"\"),\"* No olvide escribir en las celdas de 'Población Migrantes' (Digite CERO si no tiene). \",IF(AND(E27<>0,AA27=\"\"),\"* No olvide escribir en las celdas de 'Población Migrantes' (Digite CERO si no tiene). \",\"\"))","v":""},null,{"$f":"IF($D27>=$X27,0,1)","v":0},{"$f":"IF($E27>=$Y27,0,1)","v":0},{"$f":"IF($D27>=$Z27,0,1)","v":0},{"$f":"IF($E27>=$AA27,0,1)","v":0},{"$f":"IF(AND(D27<>0,X27=\"\"),1,IF(AND(E27<>0,Y27=\"\"),1,0))","v":0},{"$f":"IF(AND(D27<>0,Z27=\"\"),1,IF(AND(E27<>0,AA27=\"\"),1,0))","v":0}]
["RIESGO DE DEPENDENCIA ",null,{"$f":"SUM(D28:E28)","v":0},{"$f":"+F28+H28+J28+L28+N28+P28+R28+T28+V28","v":0},0,null,null,null,null,null,null,null,null,null,null,null,null,null,null,null,null,null,null,null,null,null,null,null,null,null,null,null,null,null,{"$f":"IF($D28>=$X28,\"\",\"* La celda 'Pueblos Originarios / Hombres' debe ser menor o igual al Total de Hombres en control. \")","v":""},{"$f":"IF($E28>=$Y28,\"\",\"* La celda 'Pueblos Originarios / Mujeres' debe ser menor o igual al Total de Mujeres en control. \")","v":""},{"$f":"IF($D28>=$Z28,\"\",\"* La celda 'Población Migrantes / Hombres' debe ser menor o igual al Total de Hombres en control. \")","v":""},{"$f":"IF($E28>=$AA28,\"\",\"* La celda 'Población Migrantes / Mujeres' debe ser menor o igual al Total de Mujeres en control. \")","v":""},{"$f":"IF(AND($D28<>0,$X28=\"\"),\"* No olvide escribir en las celdas de 'Pueblos Originarios' (Digite CERO si no tiene). \",IF(AND(E28<>0,Y28=\"\"),\"* No olvide escribir en las celdas de 'Pueblos Originarios' (Digite CERO si no tiene). \",\"\"))","v":""},{"$f":"IF(AND($D28<>0,$Z28=\"\"),\"* No olvide escribir en las celdas de 'Población Migrantes' (Digite CERO si no tiene). \",IF(AND(E28<>0,AA28=\"\"),\"* No olvide escribir en las celdas de 'Población Migrantes' (Digite CERO si no tiene). \",\"\"))","v":""},null,{"$f":"IF($D28>=$X28,0,1)","v":0},{"$f":"IF($E28>=$Y28,0,1)","v":0},{"$f":"IF($D28>=$Z28,0,1)","v":0},{"$f":"IF($E28>=$AA28,0,1)","v":0},{"$f":"IF(AND(D28<>0,X28=\"\"),1,IF(AND(E28<>0,Y28=\"\"),1,0))","v":0},{"$f":"IF(AND(D28<>0,Z28=\"\"),1,IF(AND(E28<>0,AA28=\"\"),1,0))","v":0}]
["TOTAL (EFAM)",null,{"$f":"SUM(D29:E29)","v":0},{"$f":"+F29+H29+J29+L29+N29+P29+R29+T29+V29","v":0},{"$f":"+G29+I29+K29+M29+O29+Q29+S29+U29+W29","v":0},{"$f":"SUM(F26:F28)","v":0},{"$f":"SUM(G26:G28)","v":0},{"$f":"SUM(H26:H28)","v":0},0,0,0,0,0,0,0,{"$f":"SUM(P26:P28)","v":0},0,0,0,0,0,{"$f":"SUM(V26:V28)","v":0},0,{"$f":"SUM(X26:X28)","v":0},{"$f":"SUM(Y26:Y28)","v":0},{"$f":"SUM(Z26:Z28)","v":0},{"$f":"SUM(AA26:AA28)","v":0}]
["SECCION B: POBLACIÓN BAJO CONTROL POR ESTADO NUTRICIONAL"]
["ESTADO NUTRICIONAL",null,"TOTAL",null,null,"GRUPO DE EDAD (en años) Y SEXO",null,null,null,null,null,null,null,null,null,null,null,null,null,null,null,"Pueblos Originarios",null,"Población Migrantes",null,"Personas Mayores en ELEAM",null,null,null,null,null,null,null,null,null,"Pueblos Originarios",null,"Población Migrantes",null,"Pueblos Originarios","Población Migrantes",null,"Pueblos Originarios",null,"Población Migrantes",null,"Pueblos Originarios","Población Migrantes",null,null,null,"Personas Mayores en ELEAM"]
[null,null,null,null,null,"65 a 69 años",null,"70 a 74 años",null,"75 a 79 años",null,"80 a 84 años",null,"85 a 89 años",null,"90 a 94 años",null,"95 a 99 años",null,"100 y mas años"]
[null,null,"Ambos\nsexos","Hombres","Mujeres","Hombres ","Mujeres","Hombres ","Mujeres","Hombres ","Mujeres","Hombres","Mujeres","Hombres ","Mujeres","Hombres ","Mujeres","Hombres","Mujeres","Hombres","Mujeres","Hombres","Mujeres","Hombres","Mujeres","Hombres","Mujeres",null,null,null,null,null,null,null,null,"Hombres","Mujeres","Hombres","Mujeres","No Olvide","No Olvide",null,"Hombres","Mujeres","Hombres","Mujeres","No Olvide","No Olvide",null,null,null,"Hombres","Mujeres"]
["BAJO PESO",null,{"$f":"SUM(D34:E34)","v":0},{"$f":"+F34+H34+J34+L34+N34+P34+R34+T34","v":0},{"$f":"+G34+I34+K34+M34+O34+Q34+S34+U34","v":0},null,null,null,null,null,null,null,null,null,null,null,null,null,null,null,null,null,null,null,null,null,null,null,null,null,null,null,null,null,null,{"$f":"IF($D34>=$V34,\"\",\"* El Nº de hombres bajo peso de 'Pueblos Originarios' no debe ser mayor al Total hombres bajo peso en control. \")","v":""},{"$f":"IF($E34>=$W34,\"\",\"* El Nº de mujeres bajo peso de 'Pueblos Originarios' no debe ser mayor al Total mujeres bajo peso en control. \")","v":""},{"$f":"IF($D34>=$X34,\"\",\"* El Nº de hombres bajo peso de Pueblos Migrantes no debe ser mayor al Total hombres bajo peso en control. \")","v":""},{"$f":"IF($E34>=$Y34,\"\",\"* El Nº de mujeres bajo peso de Pueblos Migrantes no debe ser mayor al Total mujeres bajo peso en control. \")","v":""},{"$f":"IF(AND(E34<>0,V34=\"\"),\"* No olvide escribir en la celda de 'Pueblos Originarios' (Digite CERO si no tiene). \",IF(AND(F34<>0,W34=\"\"),\"* No olvide escribir en la celda de 'Pueblos Originarios' (Digite CERO si no tiene). \",\"\"))","v":""},{"$f":"IF(AND(E34<>0,X34=\"\"),\"* No olvide escribir en la celda de 'Población Migrantes' (Digite CERO si no tiene). \",IF(AND(F34<>0,Y34=\"\"),\"* No olvide escribir en la celda de 'Población Migrantes' (Digite CERO si no tiene). \",\"\"))","v":""},null,{"$f":"IF($D34>=$V34,0,1)","v":0},{"$f":"IF($E34>=$W34,0,1)","v":0},{"$f":"IF($D34>=$X34,0,1)","v":0},{"$f":"IF($E34>=$Y34,0,1)","v":0},{"$f":"IF(AND(E34<>0,V34=\"\"),1,IF(AND(F34<>0,W34=\"\"),1,0))","v":0},{"$f":"IF(AND(E34<>0,X34=\"\"),1,IF(AND(F34<>0,Y34=\"\"),1,0))","v":0}]
["NORMAL",null,{"$f":"SUM(D35:E35)","v":0},{"$f":"+F35+H35+J35+L35+N35+P35+R35+T35","v":0},{"$f":"+G35+I35+K35+M35+O35+Q35+S35+U35","v":0},null,null,null,null,null,null,null,null,null,null,null,null,null,null,null,null,null,null,null,null,null,null,null,null,null,null,null,null,null,null,{"$f":"IF($D35>=$V35,\"\",\"* El Nº de hombres normal de 'Pueblos Originarios' no debe ser mayor al Total hombres normal en control. \")","v":""},{"$f":"IF($E35>=$W35,\"\",\"* El Nº de mujeres normal de 'Pueblos Originarios' no debe ser mayor al Total mujeres normal en control. \")","v":""},{"$f":"IF($D35>=$X35,\"\",\"* El Nº de hombres normal de Pueblos Migrantes no debe ser mayor al Total hombres normal en control. \")","v":""},{"$f":"IF($E35>=$Y35,\"\",\"* El Nº de mujeres normal de Pueblos Migrantes no debe ser mayor al Total mujeres normal en control. \")","v":""},{"$f":"IF(AND(E35<>0,V35=\"\"),\"* No olvide escribir en la celda de 'Pueblos Originarios' (Digite CERO si no tiene). \",IF(AND(F35<>0,W35=\"\"),\"* No olvide escribir en la celda de 'Pueblos Originarios' (Digite CERO si no tiene). \",\"\"))","v":""},{"$f":"IF(AND(E35<>0,X35=\"\"),\"* No olvide escribir en la celda de 'Población Migrantes' (Digite CERO si no tiene). \",IF(AND(F35<>0,Y35=\"\"),\"* No olvide escribir en la celda de 'Población Migrantes' (Digite CERO si no tiene). \",\"\"))","v":""},null,{"$f":"IF($D35>=$V35,0,1)","v":0},{"$f":"IF($E35>=$W35,0,1)","v":0},{"$f":"IF($D35>=$X35,0,1)","v":0},{"$f":"IF($E35>=$Y35,0,1)","v":0},{"$f":"IF(AND(E35<>0,V35=\"\"),1,IF(AND(F35<>0,W35=\"\"),1,0))","v":0},{"$f":"IF(AND(E35<>0,X35=\"\"),1,IF(AND(F35<>0,Y35=\"\"),1,0))","v":0}]
["SOBREPESO",null,{"$f":"SUM(D36:E36)","v":0},0,0,null,null,null,null,null,null,null,null,null,null,null,null,null,null,null,null,null,null,null,null,null,null,null,null,null,null,null,null,null,null,{"$f":"IF($D36>=$V36,\"\",\"* El Nº de hombres sobrepeso de 'Pueblos Originarios' no debe ser mayor al Total hombres sobrepeso en control. \")","v":""},{"$f":"IF($E36>=$W36,\"\",\"* El Nº de mujeres sobrepeso de 'Pueblos Originarios' no debe ser mayor al Total mujeres sobrepeso en control. \")","v":""},{"$f":"IF($D36>=$X36,\"\",\"* El Nº de hombres sobrepeso de Pueblos Migrantes no debe ser mayor al Total hombres sobrepeso en control. \")","v":""},{"$f":"IF($E36>=$Y36,\"\",\"* El Nº de mujeres sobrepeso de Pueblos Migrantes no debe ser mayor al Total mujeres sobrepeso en control. \")","v":""},{"$f":"IF(AND(E36<>0,V36=\"\"),\"* No olvide escribir en la celda de 'Pueblos Originarios' (Digite CERO si no tiene). \",IF(AND(F36<>0,W36=\"\"),\"* No olvide escribir en la celda de 'Pueblos Originarios' (Digite CERO si no tiene). \",\"\"))","v":""},{"$f":"IF(AND(E36<>0,X36=\"\"),\"* No olvide escribir en la celda de 'Población Migrantes' (Digite CERO si no tiene). \",IF(AND(F36<>0,Y36=\"\"),\"* No olvide escribir en la celda de 'Población Migrantes' (Digite CERO si no tiene). \",\"\"))","v":""},null,{"$f":"IF($D36>=$V36,0,1)","v":0},{"$f":"IF($E36>=$W36,0,1)","v":0},{"$f":"IF($D36>=$X36,0,1)","v":0},{"$f":"IF($E36>=$Y36,0,1)","v":0},{"$f":"IF(AND(E36<>0,V36=\"\"),1,IF(AND(F36<>0,W36=\"\"),1,0))","v":0},{"$f":"IF(AND(E36<>0,X36=\"\"),1,IF(AND(F36<>0,Y36=\"\"),1,0))","v":0}]
["OBESO",null,{"$f":"SUM(D37:E37)","v":0},0,0,null,null,null,null,null,null,null,null,null,null,null,null,null,null,null,null,null,null,null,null,null,null,null,null,null,null,null,null,null,null,{"$f":"IF($D37>=$V37,\"\",\"* El Nº de hombres obeso de 'Pueblos Originarios' no debe ser mayor al Total hombres obesos en control. \")","v":""},{"$f":"IF($E37>=$W37,\"\",\"* El Nº de mujeres obesas de 'Pueblos Originarios' no debe ser mayor al Total mujeres obesas en control. \")","v":""},{"$f":"IF($D37>=$X37,\"\",\"* El Nº de hombres obeso de Pueblos Migrantes no debe ser mayor al Total hombres obeso en control. \")","v":""},{"$f":"IF($E37>=$Y37,\"\",\"* El Nº de mujeres obesas de Pueblos Migrantes no debe ser mayor al Total mujeres obesas en control. \")","v":""},{"$f":"IF(AND(E37<>0,V37=\"\"),\"* No olvide escribir en la celda de 'Pueblos Originarios' (Digite CERO si no tiene). \",IF(AND(F37<>0,W37=\"\"),\"* No olvide escribir en la celda de 'Pueblos Originarios' (Digite CERO si no tiene). \",\"\"))","v":""},{"$f":"IF(AND(E37<>0,X37=\"\"),\"* No olvide escribir en la celda de 'Población Migrantes' (Digite CERO si no tiene). \",IF(AND(F37<>0,Y37=\"\"),\"* No olvide escribir en la celda de 'Población Migrantes' (Digite CERO si no tiene). \",\"\"))","v":""},null,{"$f":"IF($D37>=$V37,0,1)","v":0},{"$f":"IF($E37>=$W37,0,1)","v":0},{"$f":"IF($D37>=$X37,0,1)","v":0},{"$f":"IF($E37>=$Y37,0,1)","v":0},{"$f":"IF(AND(E37<>0,V37=\"\"),1,IF(AND(F37<>0,W37=\"\"),1,0))","v":0},{"$f":"IF(AND(E37<>0,X37=\"\"),1,IF(AND(F37<>0,Y37=\"\"),1,0))","v":0}]
["TOTAL ",null,{"$f":"SUM(D38:E38)","v":0},{"$f":"+F38+H38+J38+L38+N38+P38+R38+T38","v":0},{"$f":"+G38+I38+K38+M38+O38+Q38+S38+U38","v":0},{"$f":"SUM(F34:F37)","v":0},{"$f":"SUM(G34:G37)","v":0},0,0,{"$f":"SUM(J34:J37)","v":0},0,0,0,0,0,{"$f":"SUM(P34:P37)","v":0},0,0,0,0,0,{"$f":"SUM(V34:V37)","v":0},{"$f":"SUM(W34:W37)","v":0},0,0,{"$f":"SUM(Z34:Z37)","v":0},0,null,null,null,null,null,null,null,null,null,null,null,null,null,null,null,null,null,null,null,null,null,null,null,null,{"$f":"SUM(AZ34:AZ37)","v":0},0]
["SECCION C: PERSONAS MAYORES CON SOSPECHA DE MALTRATO"]
["CONCEPTO",null,"TOTAL",null,null,"GRUPO DE EDAD (en años) Y SEXO",null,null,null,null,null,null,null,null,null,null,null,null,null,null,null,"Pueblos Originarios",null,"Migrantes",null,"Personas Mayores en ELEAM"]
[null,null,null,null,null,"65 a 69 años",null,"70 a 74 años",null,"75 a 79 años",null,"80 a 84 años",null,"85 a 89 años",null,"90 a 94 años",null,"95 a 99 años",null,"100 y mas años"]
[null,null,"Ambos\nsexos","Hombres","Mujeres","Hombres ","Mujeres","Hombres ","Mujeres","Hombres ","Mujeres","Hombres","Mujeres","Hombres","Mujeres","Hombres","Mujeres","Hombres","Mujeres","Hombres","Mujeres","Hombres","Mujeres","Hombres","Mujeres","Hombres","Mujeres"]
["PERSONAS CON SOSPECHA DE MALTRATO",null,{"$f":"SUM(D43:E43)","v":0},{"$f":"+F43+H43+J43+L43+N43+P43+R43+T43","v":0},{"$f":"+G43+I43+K43+M43+O43+Q43+S43+U43","v":0},null,null,null,null,null,null,null,null,null,null,null,null,null,null,null,null,null,null,null,null,null,null,{"$f":"IF($H$21>=$H$43,\"\",\"* Los pacientes con sospecha de maltrato no pueden ser mayor que el total de Adultos Mayores en Control (70 - 74 años - Hombres). \")","v":""},{"$f":"IF($I$21>=$I$43,\"\",\"* Los pacientes con sospecha de maltrato no pueden ser mayor que el total de Adultos Mayores en Control (70 - 74 años - Mujeres). \")","v":""},{"$f":"IF($J$21>=$J$43,\"\",\"* Los pacientes con sospecha de maltrato no pueden ser mayor que el total de Adultos Mayores en Control (75 - 79 años - Hombres). \")","v":""},{"$f":"IF($K$21>=$K$43,\"\",\"* Los pacientes con sospecha de maltrato no pueden ser mayor que el total de Adultos Mayores en Control (75 - 79 años - Mujeres). \")","v":""},{"$f":"IF($T$21>=$L$43,\"\",\"* Los pacientes con sospecha de maltrato no pueden ser mayor que el total de Adultos Mayores en Control (80 y más años - Hombres). \")","v":""},{"$f":"IF($U$21>=$M$43,\"\",\"* Los pacientes con sospecha de maltrato no pueden ser mayor que el total de Adultos Mayores en Control (80 y más años - Mujeres). \")","v":""},null,{"$f":"IF($F$21>=$F$43,0,1)","v":0},{"$f":"IF($G$21>=$G$43,0,1)","v":0},{"$f":"IF($H$21>=$H$43,0,1)","v":0},{"$f":"IF($I$21>=$I$43,0,1)","v":0},{"$f":"IF($J$21>=$J$43,0,1)","v":0},{"$f":"IF($K$21>=$K$43,0,1)","v":0},{"$f":"IF($T$21>=$L$43,0,1)","v":0},{"$f":"IF($U$21>=$M$43,0,1)","v":0}]
["SECCION D: PERSONAS MAYORES EN ACTIVIDAD FÍSICA "]
["CONCEPTO",null,"TOTAL",null,null,"GRUPO DE EDAD (en años) Y SEXO",null,null,null,null,null,null,null,null,null,null,null,null,null,null,null,"Pueblos Originarios",null,"Migrantes",null,"Personas Mayores en ELEAM"]
[null,null,null,null,null,"65 a 69 años",null,"70 a 74 años",null,"75 a 79 años",null,"80 a 84 años",null,"85 a 89 años",null,"90 a 94 años",null,"95 a 99 años",null,"100 y mas años"]
[null,null,"Ambos\nsexos","Hombres","Mujeres","Hombres ","Mujeres","Hombres ","Mujeres","Hombres ","Mujeres","Hombres","Mujeres","Hombres","Mujeres","Hombres","Mujeres","Hombres","Mujeres","Hombres","Mujeres","Hombres","Mujeres","Hombres","Mujeres","Hombres","Mujeres"]
["PERSONAS EN ACTIVIDAD FÍSICA ",null,{"$f":"SUM(D48:E48)","v":0},{"$f":"+F48+H48+J48+L48+N48+P48+R48+T48","v":0},{"$f":"+G48+I48+K48+M48+O48+Q48+S48+U48","v":0},null,null,null,null,null,null,null,null,null,null,null,null,null,null,null,null,null,null,null,null,null,null,null,null,null,null,null,null,null,{"$f":"IF($C$48<=$C$15,\"\",\"* Los Adultos Mayores en actividad física no pueden ser mayor que los clasificados como Autovalentes sin/con riesgo y los riesgo de Dependencia. \")","v":""},null,{"$f":"IF($C$48<=$C$15,0,1)","v":0}]
["SECCION E: PERSONAS MAYORES CON RIESGO DE CAÍDAS"]
["INSTRUMENTO DE EVALUACIÓN","TIPO DE RIESGO","TOTAL",null,null,"GRUPO DE EDAD (en años) Y SEXO",null,null,null,null,null,null,null,null,null,null,null,null,null,null,null,"Pueblos Originarios",null,"Migrantes",null,"Personas Mayores en ELEAM"]
[null,null,null,null,null,"65 a 69 años",null,"70 a 74 años",null,"75 a 79 años",null,"80 a 84 años",null,"85 a 89 años",null,"90 a 94 años",null,"95 a 99 años",null,"100 y mas años"]
[null,null,"Ambos\nsexos","Hombres","Mujeres","Hombres ","Mujeres","Hombres ","Mujeres","Hombres ","Mujeres","Hombres","Mujeres","Hombres","Mujeres","Hombres","Mujeres","Hombres","Mujeres","Hombres","Mujeres","Hombres","Mujeres","Hombres","Mujeres","Hombres","Mujeres"]
["TIMED UP AND GO","Normal",{"$f":"SUM(D53:E53)","v":0},{"$f":"+F53+H53+J53+L53+N53+P53+R53+T53","v":0},{"$f":"+G53+I53+K53+M53+O53+Q53+S53+U53","v":0}]
[null,"Leve",{"$f":"SUM(D54:E54)","v":0},{"$f":"+F54+H54+J54+L54+N54+P54+R54+T54","v":0},{"$f":"+G54+I54+K54+M54+O54+Q54+S54+U54","v":0}]
[null,"Alto",{"$f":"SUM(D55:E55)","v":0},0,0,null,null,null,null,null,null,null,null,null,null,null,null,null,null,null,null,null,null,null,null,null,null,{"$f":"IF(SUM($G53:$G55)>$G15,\"* Riesgo de caída Mujeres (65 a 69 años) deben ser menor o igual al Total Adultos Mayores con EFAM de sección A. \",\"\")","v":""},{"$f":"IF(SUM($H53:$H55)>$H15,\"* Riesgo de caída Hombres (70 a 74 años) deben ser menor o igual al Total Adultos Mayores con EFAM de sección A. \",\"\")","v":""},{"$f":"IF(SUM($I53:$I55)>$I15,\"* Riesgo de caída Mujeres (70 a 74 años) deben ser menor o igual al Total Adultos Mayores con EFAM de sección A. \",\"\")","v":""},{"$f":"IF(SUM($J53:$J55)>$J15,\"* Riesgo de caída Hombres (75 a 79 años) deben ser menor o igual al Total Adultos Mayores con EFAM de sección A. \",\"\")","v":""},{"$f":"IF(SUM($K53:$K55)>$K15,\"* Riesgo de caída Mujeres (75 a 79 años) deben ser menor o igual al Total Adultos Mayores con EFAM de sección A. \",\"\")","v":""},{"$f":"IF(SUM($L53:$L55)>$T15,\"* Riesgo de caída Hombres (80 y más) deben ser menor o igual al Total Adultos Mayores con EFAM de sección A. \",\"\")","v":""},{"$f":"IF(SUM($M53:$M55)>$U15,\"* Riesgo de caída Mujeres (80 y más) deben ser menor o igual al Total Adultos Mayores con EFAM de sección A. \",\"\")","v":""},null,{"$f":"IF(SUM($F53:$F55)>$F15,1,0)","v":0},{"$f":"IF(SUM($G53:$G55)>$G15,1,0)","v":0},{"$f":"IF(SUM($H53:$H55)>$H15,1,0)","v":0},{"$f":"IF(SUM($I53:$I55)>$I15,1,0)","v":0},{"$f":"IF(SUM($J53:$J55)>$J15,1,0)","v":0},{"$f":"IF(SUM($K53:$K55)>$K15,1,0)","v":0},{"$f":"IF(SUM($L53:$L55)>$T15,1,0)","v":0},{"$f":"IF(SUM($M53:$M55)>$U15,1,0)","v":0}]
["ESTACIÓN UNIPODAL","Normal ",{"$f":"SUM(D56:E56)","v":0},0,0]
[null,"Alterado",{"$f":"SUM(D57:E57)","v":0},0,0]
[]
[]
[]
[]
[]
[]
[]
[]
[]
[]
[]
[]
[]
[]
[]
[]
[]
[]
[]
[]
[]
[]
[]
[{"$f":"SUM(C12:Y21, C26:AC29,C34:Y38,C43:M43,C48:M48,C53:M57)","v":0},"datos"]
[{"$f":"SUM(AK12:AR58)","v":0},"errores"]

{"sheet":"P6","index":6,"n_rows":143,"n_cols":119,"rows_kept":143,"cut":false,"hidden":false,"merged":[[9,48,11,48],[69,47,71,47],[9,39,11,39],[9,45,11,45],[9,43,10,44],[9,47,11,47],[10,27,10,28],[10,23,10,24],[10,17,10,18],[59,21,59,22],[9,46,11,46],[16,0,16,1],[74,0,75,0],[73,0,73,1],[64,0,66,1],[58,2,59,4],[44,0,44,1],[12,0,12,1],[13,0,13,1],[14,0,15,0],[17,0,18,0],[48,0,48,1],[49,0,49,1],[47,0,47,1],[50,0,54,0],[58,0,60,0],[58,1,60,1],[56,0,56,1],[46,0,46,1],[19,0,19,1],[20,0,24,0],[25,0,29,0],[30,0,33,0],[40,0,42,0],[34,0,39,0],[64,5,64,14],[64,2,65,4],[65,5,65,6],[65,7,65,8],[65,9,65,10],[70,11,70,12],[70,13,70,14],[76,0,76,1],[67,0,67,1],[72,0,72,1],[70,9,70,10],[68,0,68,14],[69,0,71,1],[69,2,70,4],[117,1,119,1],[90,0,93,0],[79,0,79,1],[85,0,89,0],[99,0,101,0],[102,0,102,1],[106,0,106,1],[108,0,108,1],[80,0,84,0],[94,0,98,0],[105,0,105,1],[115,0,115,1],[117,0,119,0],[109,0,113,0],[107,0,107,1],[103,0,103,1],[77,0,78,0],[6,0,6,20],[8,7,8,8],[8,9,8,10],[8,11,8,12],[9,0,11,1],[9,2,10,4],[8,0,8,6],[8,13,8,14],[8,15,8,16],[8,17,8,18],[9,5,9,38],[10,19,10,20],[8,19,8,20],[10,11,10,12],[8,21,8,22],[8,23,8,24],[10,35,10,36],[10,29,10,30],[10,31,10,32],[10,33,10,34],[8,31,8,32],[8,37,8,38],[10,37,10,38],[10,9,10,10],[117,2,118,4],[118,19,118,20],[118,21,118,22],[65,11,65,12],[70,17,70,18],[70,15,70,16],[70,23,70,24],[70,19,70,20],[118,13,118,14],[64,15,65,16],[69,5,69,38],[118,11,118,12],[118,15,118,16],[118,17,118,18],[118,37,118,38],[118,25,118,26],[118,27,118,28],[118,29,118,30],[118,31,118,32],[118,33,118,34],[118,35,118,36],[70,27,70,28],[117,5,117,38],[118,23,118,24],[118,5,118,6],[118,7,118,8],[118,9,118,10],[70,31,70,32],[70,25,70,26],[70,33,70,34],[70,37,70,38],[70,21,70,22],[70,5,70,6],[70,7,70,8],[8,35,8,36],[10,5,10,6],[10,7,10,8],[59,15,59,16],[9,41,10,42],[59,31,59,32],[59,33,59,34],[8,27,8,28],[8,25,8,26],[8,29,8,30],[8,33,8,34],[59,35,59,36],[58,5,58,38],[59,5,59,6],[59,7,59,8],[59,9,59,10],[59,37,59,38],[59,23,59,24],[59,25,59,26],[59,27,59,28],[10,25,10,26],[59,29,59,30],[59,17,59,18],[59,19,59,20],[59,11,59,12],[59,13,59,14],[10,21,10,22],[70,97,71,97],[70,35,70,36],[70,29,70,30],[69,43,70,44],[69,39,71,39],[69,40,71,40],[69,41,70,42],[69,46,71,46],[70,84,71,84],[70,83,71,83],[70,89,71,89],[69,45,71,45],[10,90,11,90],[10,86,10,87],[10,88,10,89],[10,84,11,84],[10,85,11,85],[10,13,10,14],[10,15,10,16],[9,40,11,40],[65,13,65,14]]}
["DATOS DEL ESTABLECIMIENTO"]
[{"$f":"CONCATENATE(\"COMUNA: \",NOMBRE!$B$2,\" - \",\"( \",NOMBRE!$C$2,NOMBRE!$D$2,NOMBRE!$E$2,NOMBRE!$F$2,NOMBRE!$G$2,\" )\")","v":"COMUNA:  - (  )"}]
[{"$f":"CONCATENATE(\"ESTABLECIMIENTO/ESTRATEGIA: \",NOMBRE!$B$3,\" - \",\"( \",NOMBRE!$C$3,NOMBRE!$D$3,NOMBRE!$E$3,NOMBRE!$F$3,NOMBRE!$G$3,NOMBRE!$H$3,\" )\")","v":"ESTABLECIMIENTO/ESTRATEGIA:  - (  )"}]
[{"$f":"CONCATENATE(\"MES: \",NOMBRE!$B$6,\" - \",\"( \",NOMBRE!$C$6,NOMBRE!$D$6,\" )\")","v":"MES:  - (  )"}]
[{"$f":"CONCATENATE(\"AÑO: \",NOMBRE!$B$7)","v":"AÑO: 2023"}]
[]
["REM-P6. POBLACIÓN EN CONTROL PROGRAMA DE SALUD MENTAL EN ATENCIÓN PRIMARIA Y ESPECIALIDAD"]
["A. ATENCIÓN PRIMARIA"]
["SECCION A.1: POBLACIÓN EN CONTROL EN APS AL CORTE"]
["CONCEPTO",null,"T O T A L",null,null,"GRUPO DE EDAD (en años)",null,null,null,null,null,null,null,null,null,null,null,null,null,null,null,null,null,null,null,null,null,null,null,null,null,null,null,null,null,null,null,null,null,"Gestantes","Madre de Hijo menor de 5 años ","Pueblos Originarios",null,"Población Migrantes",null,"Niños, Niñas, Adolescentes y Jóvenes SENAME","Niños, Niñas, Adolescentes y Jóvenes Mejor Niñez","Plan Cuidado Integral Elaborado","TRANS"]
[null,null,null,null,null,"0 a 4 años",null,"5 a 9 años",null,"10 a 14 años",null,"15 a 19 años",null,"20 a 24 años",null,"25 a 29 años",null,"30 a 34 años",null,"35 a 39 años",null,"40 a 44 años",null,"45 a 49 años",null,"50 a 54 años",null,"55 a 59 años",null,"60 a 64 años",null,"65 a 69 años",null,"70 a 74 años",null,"75 a 79 años",null,"80 y más años",null,null,null,null,null,null,null,null,null,null,null,null,null,null,null,null,null,null,null,null,null,null,null,null,null,null,null,null,null,null,null,null,null,null,null,null,null,null,null,null,null,null,null,null,null,null,"Gestantes","Madre de hijos","Pueblos originarios",null,"Poblacion Migrantes",null,"Niños y niñas SENAME","Gestantes","Madre de hojos","Niños y niñas SENAME","Pueblos originarios","Poblacion Migrantes",null,null,null,null,null,null,null,null,"Gestantes","Madre de hijos","Pueblos originarios","Pueblos originarios","Poblacion Migrantes","Poblacion Migrantes","Niños y niñas SENAME","Gestantes","Madre de hojos","Niños y niñas SENAME","Pueblos originarios","Poblacion Migrantes"]
[null,null,"Ambos\nsexos","Hombres","Mujeres","Hombres","Mujeres","Hombres","Mujeres","Hombres","Mujeres","Hombres","Mujeres","Hombres","Mujeres","Hombres","Mujeres","Hombres","Mujeres","Hombres","Mujeres","Hombres","Mujeres","Hombres","Mujeres","Hombres","Mujeres","Hombres","Mujeres","Hombres","Mujeres","Hombres ","Mujeres","Hombres ","Mujeres","Hombres ","Mujeres","Hombres","Mujeres",null,null,"Hombres","Mujeres","Hombres","Mujeres",null,null,null,null,null,null,null,null,null,null,null,null,null,null,null,null,null,null,null,null,null,null,null,null,null,null,null,null,null,null,null,null,null,null,null,null,null,null,null,null,null,"Hombres","Mujeres","Hombres","Mujeres",null,"No Olvide","No Olvide","No Olvide","No Olvide","No Olvide",null,null,null,null,null,null,null,null,null,null,"Hombres","Mujeres","Hombres","Mujeres",null,"No Olvide","No Olvide","No Olvide","No Olvide","No Olvide"]
["NUMERO DE PERSONAS EN CONTROL EN EL PROGRAMA",null,{"$f":"SUM(D13:E13)","v":0},{"$f":"+F13+H13+J13+L13+N13+P13+R13+T13+V13+X13+Z13+AB13+AD13+AF13+AH13+AJ13+AL13","v":0},{"$f":"+G13+I13+K13+M13+O13+Q13+S13+U13+W13+Y13+AA13+AC13+AE13+AG13+AI13+AK13+AM13","v":0},null,null,null,null,null,null,null,null,null,null,null,null,null,null,null,null,null,null,null,null,null,null,null,null,null,null,null,null,null,null,null,null,null,null,null,null,null,null,null,null,null,null,null,null,null,null,null,null,null,null,null,null,null,null,null,null,null,null,null,null,null,null,null,null,null,null,null,null,null,null,null,null,null,null,null,null,null,null,null,{"$f":"IF($AN13>$E13,\"* La celda 'Gestantes' debe ser menor o igual al Total de Mujeres en control. \",\"\")","v":""},{"$f":"IF($AO13>$E13,\"* La celda 'Madres de Hijos menor de 5 años' debe ser menor o igual al Total de Mujeres en control. \",\"\")","v":""},{"$f":"IF(($AP13)>$D13,\"* La celda 'Pueblos Originarios / Hombres' debe ser menor o igual al Total de Hombres en control. \",\"\")","v":""},{"$f":"IF($AQ13>$E13,\"* La celda 'Pueblos Originarios / Mujeres' debe ser menor o igual al Total de Mujeres en control. \",\"\")","v":""},{"$f":"IF(($AR13)>$D13,\"* La celda 'Población Migrantes / Hombres' debe ser menor o igual al Total de Hombres en control. \",\"\")","v":""},{"$f":"IF($AS13>$E13,\"* La celda 'Población Migrantes / Mujeres' debe ser menor o igual al Total de Mujeres en control. \",\"\")","v":""},{"$f":"IF($AT13>$C13,\"* La celda 'Niños, Niñas, Adolescentes y Jóvenes de Población SENAME' debe ser menor o igual al Total de Ambos Sexos. \",\"\")","v":""},{"$f":"IF(AND($C13<>0,$AN13=\"\"),\"* No olvide escribir en la celda de 'Gestantes' (Digite CERO si no tiene). \",\"\")","v":""},{"$f":"IF(AND($C13<>0,$AO13=\"\"),\"* No olvide escribir en la celda de 'Madres de Hijos menor de 5 años' (Digite CERO si no tiene). \",\"\")","v":""},{"$f":"IF(AND($C13<>0,$AT13=\"\"),\"* No olvide escribir en la celda de 'Niños, Niñas, Adolescentes y Jóvenes de Población SENAME' (Digite CERO si no tiene). \",\"\")","v":""},{"$f":"IF(AND($D13<>0,$AP13=\"\"),\"* No olvide escribir en las celdas de 'Pueblos Originarios' (Digite CERO si no tiene). \",IF(AND($E13<>0,$AQ13=\"\"),\"* No olvide escribir en las celdas de 'Pueblos Originarios' (Digite CERO si no tiene). \",\"\"))","v":""},{"$f":"IF(AND($D13<>0,$AR13=\"\"),\"* No olvide escribir en las celdas de 'Población Migrantes' (Digite CERO si no tiene). \",IF(AND($E13<>0,$AS13=\"\"),\"* No olvide escribir en las celdas de 'Población Migrantes' (Digite CERO si no tiene). \",\"\"))","v":""},null,null,null,null,null,null,null,null,{"$f":"IF($AN13>$E13,1,0)","v":0},{"$f":"IF($AO13>$E13,1,0)","v":0},{"$f":"IF(($AP13)>$D13,1,0)","v":0},{"$f":"IF($AQ13>$E13,1,0)","v":0},{"$f":"IF(($AR13)>$D13,1,0)","v":0},{"$f":"IF($AS13>$E13,1,0)","v":0},{"$f":"IF($AT13>$C13,1,0)","v":0},{"$f":"IF(AND($C13<>0,$AN13=\"\"),1,0)","v":0},{"$f":"IF(AND($C13<>0,$AO13=\"\"),1,0)","v":0},{"$f":"IF(AND($C13<>0,$AT13=\"\"),1,0)","v":0},{"$f":"IF(AND($D13<>0,$AP13=\"\"),1,IF(AND($E13<>0,$AQ13=\"\"),1,0))","v":0},{"$f":"IF(AND($D13<>0,$AR13=\"\"),1,IF(AND($E13<>0,$AS13=\"\"),1,0))","v":0}]
["FACTORES DE RIESGO Y CONDICIONANTES DE LA SALUD MENTAL"]
["VIOLENCIA ","VICTIMA",{"$f":"SUM(D15:E15)","v":0},{"$f":"+F15+H15+J15+L15+N15+P15+R15+T15+V15+X15+Z15+AB15+AD15+AF15+AH15+AJ15+AL15","v":0},{"$f":"+G15+I15+K15+M15+O15+Q15+S15+U15+W15+Y15+AA15+AC15+AE15+AG15+AI15+AK15+AM15","v":0},null,null,null,null,null,null,null,null,null,null,null,null,null,null,null,null,null,null,null,null,null,null,null,null,null,null,null,null,null,null,null,null,null,null,null,null,null,null,null,null,null,null,null,null,null,null,null,null,null,null,null,null,null,null,null,null,null,null,null,null,null,null,null,null,null,null,null,null,null,null,null,null,null,null,null,null,null,null,null,{"$f":"IF($AN15>$E15,\"* La celda 'Gestantes' debe ser menor o igual al Total de Mujeres en control. \",\"\")","v":""},{"$f":"IF($AO15>$E15,\"* La celda 'Madres de Hijos menor de 5 años' debe ser menor o igual al Total de Mujeres en control. \",\"\")","v":""},{"$f":"IF(($AP15)>$D15,\"* La celda 'Pueblos Originarios / Hombres' debe ser menor o igual al Total de Hombres en control. \",\"\")","v":""},{"$f":"IF($AQ15>$E15,\"* La celda 'Pueblos Originarios / Mujeres' debe ser menor o igual al Total de Mujeres en control. \",\"\")","v":""},{"$f":"IF(($AR15)>$D15,\"* La celda 'Población Migrantes / Hombres' debe ser menor o igual al Total de Hombres en control. \",\"\")","v":""},{"$f":"IF($AS15>$E15,\"* La celda 'Población Migrantes / Mujeres' debe ser menor o igual al Total de Mujeres en control. \",\"\")","v":""},{"$f":"IF($AT15>$C15,\"* La celda 'Niños, Niñas, Adolescentes y Jóvenes de Población SENAME' debe ser menor o igual al Total de Ambos Sexos. \",\"\")","v":""},{"$f":"IF(AND($C15<>0,$AN15=\"\"),\"* No olvide escribir en la celda de 'Gestantes' (Digite CERO si no tiene). \",\"\")","v":""},{"$f":"IF(AND($C15<>0,$AO15=\"\"),\"* No olvide escribir en la celda de 'Madres de Hijos menor de 5 años' (Digite CERO si no tiene). \",\"\")","v":""},{"$f":"IF(AND($C15<>0,$AT15=\"\"),\"* No olvide escribir en la celda de 'Niños, Niñas, Adolescentes y Jóvenes de Población SENAME' (Digite CERO si no tiene). \",\"\")","v":""},{"$f":"IF(AND($D15<>0,$AP15=\"\"),\"* No olvide escribir en las celdas de 'Pueblos Originarios' (Digite CERO si no tiene). \",IF(AND($E15<>0,$AQ15=\"\"),\"* No olvide escribir en las celdas de 'Pueblos Originarios' (Digite CERO si no tiene). \",\"\"))","v":""},{"$f":"IF(AND($D15<>0,$AR15=\"\"),\"* No olvide escribir en las celdas de 'Población Migrantes' (Digite CERO si no tiene). \",IF(AND($E15<>0,$AS15=\"\"),\"* No olvide escribir en las celdas de 'Población Migrantes' (Digite CERO si no tiene). \",\"\"))","v":""},null,null,null,null,null,null,null,null,{"$f":"IF($AN15>$E15,1,0)","v":0},{"$f":"IF($AO15>$E15,1,0)","v":0},{"$f":"IF(($AP15)>$D15,1,0)","v":0},{"$f":"IF($AQ15>$E15,1,0)","v":0},{"$f":"IF(($AR15)>$D15,1,0)","v":0},{"$f":"IF($AS15>$E15,1,0)","v":0},{"$f":"IF($AT15>$C15,1,0)","v":0},{"$f":"IF(AND($C15<>0,$AN15=\"\"),1,0)","v":0},{"$f":"IF(AND($C15<>0,$AO15=\"\"),1,0)","v":0},{"$f":"IF(AND($C15<>0,$AT15=\"\"),1,0)","v":0},{"$f":"IF(AND($D15<>0,$AP15=\"\"),1,IF(AND($E15<>0,$AQ15=\"\"),1,0))","v":0},{"$f":"IF(AND($D15<>0,$AR15=\"\"),1,IF(AND($E15<>0,$AS15=\"\"),1,0))","v":0}]
[null,"AGRESOR/A",0,0,0,null,null,null,null,null,null,null,null,null,null,null,null,null,null,null,null,null,null,null,null,null,null,null,null,null,null,null,null,null,null,null,null,null,null,null,null,null,null,null,null,null,null,null,null,null,null,null,null,null,null,null,null,null,null,null,null,null,null,null,null,null,null,null,null,null,null,null,null,null,null,null,null,null,null,null,null,null,null,null,"","","","","","","","","","","","",null,null,null,null,null,null,null,null,0,0,0,0,0,0,0,0,0,0,0,0]
["ABUSO SEXUAL",null,0,0,0,null,null,null,null,null,null,null,null,null,null,null,null,null,null,null,null,null,null,null,null,null,null,null,null,null,null,null,null,null,null,null,null,null,null,null,null,null,null,null,null,null,null,null,null,null,null,null,null,null,null,null,null,null,null,null,null,null,null,null,null,null,null,null,null,null,null,null,null,null,null,null,null,null,null,null,null,null,null,null,"","","","","","","","","","","","",null,null,null,null,null,null,null,null,0,0,0,0,0,0,0,0,0,0,0,0]
["SUICIDIO","IDEACIÓN",0,{"$f":"+H18+J18+L18+N18+P18+R18+T18+V18+X18+Z18+AB18+AD18+AF18+AH18+AJ18+AL18","v":0},{"$f":"+I18+K18+M18+O18+Q18+S18+U18+W18+Y18+AA18+AC18+AE18+AG18+AI18+AK18+AM18","v":0},null,null,null,null,null,null,null,null,null,null,null,null,null,null,null,null,null,null,null,null,null,null,null,null,null,null,null,null,null,null,null,null,null,null,null,null,null,null,null,null,null,null,null,null,null,null,null,null,null,null,null,null,null,null,null,null,null,null,null,null,null,null,null,null,null,null,null,null,null,null,null,null,null,null,null,null,null,null,null,"","","","","","","","","","","","",null,null,null,null,null,null,null,null,0,0,0,0,0,0,0,0,0,0,0,0]
[null,"INTENTO",0,{"$f":"+H19+J19+L19+N19+P19+R19+T19+V19+X19+Z19+AB19+AD19+AF19+AH19+AJ19+AL19","v":0},{"$f":"+I19+K19+M19+O19+Q19+S19+U19+W19+Y19+AA19+AC19+AE19+AG19+AI19+AK19+AM19","v":0},null,null,null,null,null,null,null,null,null,null,null,null,null,null,null,null,null,null,null,null,null,null,null,null,null,null,null,null,null,null,null,null,null,null,null,null,null,null,null,null,null,null,null,null,null,null,null,null,null,null,null,null,null,null,null,null,null,null,null,null,null,null,null,null,null,null,null,null,null,null,null,null,null,null,null,null,null,null,null,"","","","","","","","","","","","",null,null,null,null,null,null,null,null,0,0,0,0,0,0,0,0,0,0,0,0]
["PERSONAS CON DIAGNOSTICOS DE TRASTORNOS MENTALES ",null,0,0,0,null,null,null,null,null,null,null,null,null,null,null,null,null,null,null,null,null,null,null,null,null,null,null,null,null,null,null,null,null,null,null,null,null,null,null,null,null,null,null,null,null,null,null,null,null,null,null,null,null,null,null,null,null,null,null,null,null,null,null,null,null,null,null,null,null,null,null,null,null,null,null,null,null,null,null,null,null,null,null,"","","","","","","","","","","","",null,null,null,null,null,null,null,null,0,0,0,0,0,0,0,0,0,0,0,0]
["TRASTORNOS DEL HUMOR\n(AFECTIVOS)","DEPRESIÓN LEVE",{"$f":"SUM(D21:E21)","v":0},0,0,null,null,null,null,null,null,null,null,null,null,null,null,null,null,null,null,null,null,null,null,null,null,null,null,null,null,null,null,null,null,null,null,null,null,null,null,null,null,null,null,null,null,null,null,null,null,null,null,null,null,null,null,null,null,null,null,null,null,null,null,null,null,null,null,null,null,null,null,null,null,null,null,null,null,null,null,null,null,null,"","","","","","","","","","","","",null,null,null,null,null,null,null,null,0,0,0,0,0,0,0,0,0,0,0,0]
[null,"DEPRESIÓN MODERADA",0,0,0,null,null,null,null,null,null,null,null,null,null,null,null,null,null,null,null,null,null,null,null,null,null,null,null,null,null,null,null,null,null,null,null,null,null,null,null,null,null,null,null,null,null,null,null,null,null,null,null,null,null,null,null,null,null,null,null,null,null,null,null,null,null,null,null,null,null,null,null,null,null,null,null,null,null,null,null,null,null,null,"","","","","","","","","","","","",null,null,null,null,null,null,null,null,0,0,0,0,0,0,0,0,0,0,0,0]
[null,"DEPRESIÓN GRAVE",0,0,0,null,null,null,null,null,null,null,null,null,null,null,null,null,null,null,null,null,null,null,null,null,null,null,null,null,null,null,null,null,null,null,null,null,null,null,null,null,null,null,null,null,null,null,null,null,null,null,null,null,null,null,null,null,null,null,null,null,null,null,null,null,null,null,null,null,null,null,null,null,null,null,null,null,null,null,null,null,null,null,"","","","","","","","","","","","",null,null,null,null,null,null,null,null,0,0,0,0,0,0,0,0,0,0,0,0]
[null,"DEPRESIÓN POST PARTO",0,null,{"$f":"K24+M24+O24+Q24+S24+U24+W24+Y24+AA24+AC24","v":0},null,null,null,null,null,null,null,null,null,null,null,null,null,null,null,null,null,null,null,null,null,null,null,null,null,null,null,null,null,null,null,null,null,null,null,null,null,null,null,null,null,null,null,null,null,null,null,null,null,null,null,null,null,null,null,null,null,null,null,null,null,null,null,null,null,null,null,null,null,null,null,null,null,null,null,null,null,null,null,null,"",null,"",null,"","",null,{"$f":"IF(AND($C24<>0,$AO24=\"\"),\"* No olvide escribir en la celda de 'Madres de Hijos menor de 5 años' (Digite CERO si no tiene). \",\"\")","v":""},{"$f":"IF(AND($C24<>0,$AT24=\"\"),\"* No olvide escribir en la celda de 'Niños, Niñas, Adolescentes y Jóvenes de Población SENAME' (Digite CERO si no tiene). \",\"\")","v":""},{"$f":"IF(AND($E24<>0,$AQ24=\"\"),\"* No olvide escribir en las celdas de 'Pueblos Originarios / Mujeres' (Digite CERO si no tiene). \",\"\")","v":""},{"$f":"IF(AND($E24<>0,$AS24=\"\"),\"* No olvide escribir en las celdas de ''Población Migrantes / Mujeres' (Digite CERO si no tiene). \",\"\")","v":""},null,null,null,null,null,null,null,null,null,0,null,0,null,0,0,null,0,0,{"$f":"IF(AND($E24<>0,$AQ24=\"\"),1,0)","v":0},{"$f":"IF(AND($E24<>0,$AS24=\"\"),1,0)","v":0}]
[null,"TRASTORNO BIPOLAR",0,{"$f":"+F25+H25+J25+L25+N25+P25+R25+T25+V25+X25+Z25+AB25+AD25+AF25+AH25+AJ25+AL25","v":0},0,null,null,null,null,null,null,null,null,null,null,null,null,null,null,null,null,null,null,null,null,null,null,null,null,null,null,null,null,null,null,null,null,null,null,null,null,null,null,null,null,null,null,null,null,null,null,null,null,null,null,null,null,null,null,null,null,null,null,null,null,null,null,null,null,null,null,null,null,null,null,null,null,null,null,null,null,null,null,null,{"$f":"IF($AN25>$E25,\"* La celda 'Gestantes' debe ser menor o igual al Total de Mujeres en control. \",\"\")","v":""},{"$f":"IF($AO25>$E25,\"* La celda 'Madres de Hijos menor de 5 años' debe ser menor o igual al Total de Mujeres en control. \",\"\")","v":""},{"$f":"IF(($AP25)>$D25,\"* La celda 'Pueblos Originarios / Hombres' debe ser menor o igual al Total de Hombres en control. \",\"\")","v":""},{"$f":"IF($AQ25>$E25,\"* La celda 'Pueblos Originarios / Mujeres' debe ser menor o igual al Total de Mujeres en control. \",\"\")","v":""},{"$f":"IF(($AR25)>$D25,\"* La celda 'Población Migrantes / Hombres' debe ser menor o igual al Total de Hombres en control. \",\"\")","v":""},{"$f":"IF($AS25>$E25,\"* La celda 'Población Migrantes / Mujeres' debe ser menor o igual al Total de Mujeres en control. \",\"\")","v":""},{"$f":"IF($AT25>$C25,\"* La celda 'Niños, Niñas, Adolescentes y Jóvenes de Población SENAME' debe ser menor o igual al Total de Ambos Sexos. \",\"\")","v":""},{"$f":"IF(AND($C25<>0,$AN25=\"\"),\"* No olvide escribir en la celda de 'Gestantes' (Digite CERO si no tiene). \",\"\")","v":""},{"$f":"IF(AND($C25<>0,$AO25=\"\"),\"* No olvide escribir en la celda de 'Madres de Hijos menor de 5 años' (Digite CERO si no tiene). \",\"\")","v":""},{"$f":"IF(AND($C25<>0,$AT25=\"\"),\"* No olvide escribir en la celda de 'Niños, Niñas, Adolescentes y Jóvenes de Población SENAME' (Digite CERO si no tiene). \",\"\")","v":""},{"$f":"IF(AND($D25<>0,$AP25=\"\"),\"* No olvide escribir en las celdas de 'Pueblos Originarios' (Digite CERO si no tiene). \",IF(AND($E25<>0,$AQ25=\"\"),\"* No olvide escribir en las celdas de 'Pueblos Originarios' (Digite CERO si no tiene). \",\"\"))","v":""},{"$f":"IF(AND($D25<>0,$AR25=\"\"),\"* No olvide escribir en las celdas de 'Población Migrantes' (Digite CERO si no tiene). \",IF(AND($E25<>0,$AS25=\"\"),\"* No olvide escribir en las celdas de 'Población Migrantes' (Digite CERO si no tiene). \",\"\"))","v":""},null,null,null,null,null,null,null,null,{"$f":"IF($AN25>$E25,1,0)","v":0},0,{"$f":"IF(($AP25)>$D25,1,0)","v":0},0,{"$f":"IF(($AR25)>$D25,1,0)","v":0},0,0,{"$f":"IF(AND($C25<>0,$AN25=\"\"),1,0)","v":0},0,0,{"$f":"IF(AND($D25<>0,$AP25=\"\"),1,IF(AND($E25<>0,$AQ25=\"\"),1,0))","v":0},{"$f":"IF(AND($D25<>0,$AR25=\"\"),1,IF(AND($E25<>0,$AS25=\"\"),1,0))","v":0}]
["TRASTORNOS MENTALES Y DEL COMPORTAMIENTO DEBIDO A CONSUMO SUSTANCIAS PSICOTROPICAS","CONSUMO PERJUDICIAL DE ALCOHOL ",0,0,0,null,null,null,null,null,null,null,null,null,null,null,null,null,null,null,null,null,null,null,null,null,null,null,null,null,null,null,null,null,null,null,null,null,null,null,null,null,null,null,null,null,null,null,null,null,null,null,null,null,null,null,null,null,null,null,null,null,null,null,null,null,null,null,null,null,null,null,null,null,null,null,null,null,null,null,null,null,null,null,{"$f":"IF($AN26>$E26,\"* La celda 'Gestantes' debe ser menor o igual al Total de Mujeres en control. \",\"\")","v":""},{"$f":"IF($AO26>$E26,\"* La celda 'Madres de Hijos menor de 5 años' debe ser menor o igual al Total de Mujeres en control. \",\"\")","v":""},"","","","","",{"$f":"IF(AND($C26<>0,$AN26=\"\"),\"* No olvide escribir en la celda de 'Gestantes' (Digite CERO si no tiene). \",\"\")","v":""},{"$f":"IF(AND($C26<>0,$AO26=\"\"),\"* No olvide escribir en la celda de 'Madres de Hijos menor de 5 años' (Digite CERO si no tiene). \",\"\")","v":""},"","","",null,null,null,null,null,null,null,null,{"$f":"IF($AN26>$E26,1,0)","v":0},0,0,0,0,0,0,{"$f":"IF(AND($C26<>0,$AN26=\"\"),1,0)","v":0},0,0,0,0]
[null,"CONSUMO DEPENDIENTE DEL ALCOHOL ",0,0,0,null,null,null,null,null,null,null,null,null,null,null,null,null,null,null,null,null,null,null,null,null,null,null,null,null,null,null,null,null,null,null,null,null,null,null,null,null,null,null,null,null,null,null,null,null,null,null,null,null,null,null,null,null,null,null,null,null,null,null,null,null,null,null,null,null,null,null,null,null,null,null,null,null,null,null,null,null,null,null,{"$f":"IF($AN27>$E27,\"* La celda 'Gestantes' debe ser menor o igual al Total de Mujeres en control. \",\"\")","v":""},{"$f":"IF($AO27>$E27,\"* La celda 'Madres de Hijos menor de 5 años' debe ser menor o igual al Total de Mujeres en control. \",\"\")","v":""},"","","","","",{"$f":"IF(AND($C27<>0,$AN27=\"\"),\"* No olvide escribir en la celda de 'Gestantes' (Digite CERO si no tiene). \",\"\")","v":""},{"$f":"IF(AND($C27<>0,$AO27=\"\"),\"* No olvide escribir en la celda de 'Madres de Hijos menor de 5 años' (Digite CERO si no tiene). \",\"\")","v":""},"","","",null,null,null,null,null,null,null,null,{"$f":"IF($AN27>$E27,1,0)","v":0},0,0,0,0,0,0,{"$f":"IF(AND($C27<>0,$AN27=\"\"),1,0)","v":0},0,0,0,0]
[null,"CONSUMO PERJUDICIAL DE DROGAS",0,0,0]
[null,"CONSUMO DEPENDIENTE DE DROGAS ",0,0,0]
[null,"CONSUMO DE DROGAS Y ALCOHOL ",0,0,0,null,null,null,null,null,null,null,null,null,null,null,null,null,null,null,null,null,null,null,null,null,null,null,null,null,null,null,null,null,null,null,null,null,null,null,null,null,null,null,null,null,null,null,null,null,null,null,null,null,null,null,null,null,null,null,null,null,null,null,null,null,null,null,null,null,null,null,null,null,null,null,null,null,null,null,null,null,null,null,{"$f":"IF($AN30>$E30,\"* La celda 'Gestantes' debe ser menor o igual al Total de Mujeres en control. \",\"\")","v":""},{"$f":"IF($AO30>$E30,\"* La celda 'Madres de Hijos menor de 5 años' debe ser menor o igual al Total de Mujeres en control. \",\"\")","v":""},"","","","","",{"$f":"IF(AND($C30<>0,$AN30=\"\"),\"* No olvide escribir en la celda de 'Gestantes' (Digite CERO si no tiene). \",\"\")","v":""},{"$f":"IF(AND($C30<>0,$AO30=\"\"),\"* No olvide escribir en la celda de 'Madres de Hijos menor de 5 años' (Digite CERO si no tiene). \",\"\")","v":""},"","","",null,null,null,null,null,null,null,null,{"$f":"IF($AN30>$E30,1,0)","v":0},0,0,0,0,0,0,{"$f":"IF(AND($C30<>0,$AN30=\"\"),1,0)","v":0},0,0,0,0]
["TRASTORNOS DEL COMPORTAMIENTO Y DE LAS EMOCIONES DE COMIENZO HABITUAL EN LA INFANCIA Y ADOLESCENCIA","TRASTORNO HIPERCINÉTICO",0,0,0,null,null,null,null,null,null,null,null,null,null,null,null,null,null,null,null,null,null,null,null,null,null,null,null,null,null,null,null,null,null,null,null,null,null,null,null,null,null,null,null,null,null,null,null,null,null,null,null,null,null,null,null,null,null,null,null,null,null,null,null,null,null,null,null,null,null,null,null,null,null,null,null,null,null,null,null,null,null,null,null,null,"","","","","",null,null,"","","",null,null,null,null,null,null,null,null,null,null,0,0,0,0,0,null,null,0,0,0]
[null,"TRASTORNO DISOCIAL DESAFIANTE Y OPOSICIONISTA",0,0,0,null,null,null,null,null,null,null,null,null,null,null,null,null,null,null,null,null,null,null,null,null,null,null,null,null,null,null,null,null,null,null,null,null,null,null,null,null,null,null,null,null,null,null,null,null,null,null,null,null,null,null,null,null,null,null,null,null,null,null,null,null,null,null,null,null,null,null,null,null,null,null,null,null,null,null,null,null,null,null,null,null,"","","","","",null,null,"","","",null,null,null,null,null,null,null,null,null,null,0,0,0,0,0,null,null,0,0,0]
[null,"TRASTORNO DE ANSIEDAD DE SEPARACIÓN EN LA INFANCIA",0,{"$f":"+F33+H33+J33","v":0},{"$f":"+G33+I33+K33","v":0},null,null,null,null,null,null,null,null,null,null,null,null,null,null,null,null,null,null,null,null,null,null,null,null,null,null,null,null,null,null,null,null,null,null,null,null,null,null,null,null,null,null,null,null,null,null,null,null,null,null,null,null,null,null,null,null,null,null,null,null,null,null,null,null,null,null,null,null,null,null,null,null,null,null,null,null,null,null,null,null,null,"","","","","",null,null,"","","",null,null,null,null,null,null,null,null,null,null,0,0,0,0,0,null,null,0,0,0]
[null,"OTROS TRASTORNOS DEL COMPORTAMIENTO Y DE LAS EMOCIONES DE COMIENZO HABITUAL EN LA INFANCIA Y ADOLESCENCIA",0,{"$f":"+F34+H34+J34+L34+N34","v":0},{"$f":"+G34+I34+K34+M34+O34","v":0},null,null,null,null,null,null,null,null,null,null,null,null,null,null,null,null,null,null,null,null,null,null,null,null,null,null,null,null,null,null,null,null,null,null,null,null,null,null,null,null,null,null,null,null,null,null,null,null,null,null,null,null,null,null,null,null,null,null,null,null,null,null,null,null,null,null,null,null,null,null,null,null,null,null,null,null,null,null,null,null,null,"","","","","",null,null,"","","",null,null,null,null,null,null,null,null,null,null,0,0,0,0,0,null,null,0,0,0]
["TRASTORNOS DE ANSIEDAD","TRASTORNO DE ESTRÉS POST TRAUMATICO",0,{"$f":"SUM(F35+H35+J35+L35+N35+P35+R35+T35+V35+X35+Z35+AB35+AD35+AF35+AH35+AJ35+AL35)","v":0},{"$f":"SUM(G35+I35+K35+M35+O35+Q35+S35+U35+W35+Y35+AA35+AC35+AE35+AG35+AI35+AK35+AM35)","v":0},null,null,null,null,null,null,null,null,null,null,null,null,null,null,null,null,null,null,null,null,null,null,null,null,null,null,null,null,null,null,null,null,null,null,null,null,null,null,null,null,null,null,null,null,null,null,null,null,null,null,null,null,null,null,null,null,null,null,null,null,null,null,null,null,null,null,null,null,null,null,null,null,null,null,null,null,null,null,null,{"$f":"IF($AN35>$E35,\"* La celda 'Gestantes' debe ser menor o igual al Total de Mujeres en control. \",\"\")","v":""},{"$f":"IF($AO35>$E35,\"* La celda 'Madres de Hijos menor de 5 años' debe ser menor o igual al Total de Mujeres en control. \",\"\")","v":""},"","","","","",{"$f":"IF(AND($C35<>0,$AN35=\"\"),\"* No olvide escribir en la celda de 'Gestantes' (Digite CERO si no tiene). \",\"\")","v":""},{"$f":"IF(AND($C35<>0,$AO35=\"\"),\"* No olvide escribir en la celda de 'Madres de Hijos menor de 5 años' (Digite CERO si no tiene). \",\"\")","v":""},"","","",null,null,null,null,null,null,null,null,{"$f":"IF($AN35>$E35,1,0)","v":0},{"$f":"IF($AO35>$E35,1,0)","v":0},0,0,0,0,0,{"$f":"IF(AND($C35<>0,$AN35=\"\"),1,0)","v":0},{"$f":"IF(AND($C35<>0,$AO35=\"\"),1,0)","v":0},0,0,0]
[null,"TRASTORNO DE PÁNICO CON AGORAFOBIO",0,0,0,null,null,null,null,null,null,null,null,null,null,null,null,null,null,null,null,null,null,null,null,null,null,null,null,null,null,null,null,null,null,null,null,null,null,null,null,null,null,null,null,null,null,null,null,null,null,null,null,null,null,null,null,null,null,null,null,null,null,null,null,null,null,null,null,null,null,null,null,null,null,null,null,null,null,null,null,null,null,null,"","","","","","","","","","","","",null,null,null,null,null,null,null,null,0,0,0,0,0,0,0,0,0,0,0,0]
[null,"TRASTORNO DE PÁNICO SIN AGORAFOBIO"]
[null,"FOBIAS SOCIALES",0,{"$f":"SUM(F38+H38+J38+L38+N38+P38+R38+T38+V38+X38+Z38+AB38+AD38+AF38+AH38+AJ38+AL38)","v":0},0,null,null,null,null,null,null,null,null,null,null,null,null,null,null,null,null,null,null,null,null,null,null,null,null,null,null,null,null,null,null,null,null,null,null,null,null,null,null,null,null,null,null,null,null,null,null,null,null,null,null,null,null,null,null,null,null,null,null,null,null,null,null,null,null,null,null,null,null,null,null,null,null,null,null,null,null,null,null,null,"","","","","","","","","","","","",null,null,null,null,null,null,null,null,0,0,0,0,0,0,0,0,0,0,0,0]
[null,"TRASTORNOS DE ANSIEDAD GENERALIZADA",0,0,0,null,null,null,null,null,null,null,null,null,null,null,null,null,null,null,null,null,null,null,null,null,null,null,null,null,null,null,null,null,null,null,null,null,null,null,null,null,null,null,null,null,null,null,null,null,null,null,null,null,null,null,null,null,null,null,null,null,null,null,null,null,null,null,null,null,null,null,null,null,null,null,null,null,null,null,null,null,null,null,"","","","","","","","","","","","",null,null,null,null,null,null,null,null,0,0,0,0,0,0,0,0,0,0,0,0]
[null,"OTROS TRASTORNOS DE ANSIEDAD",0,0,0,null,null,null,null,null,null,null,null,null,null,null,null,null,null,null,null,null,null,null,null,null,null,null,null,null,null,null,null,null,null,null,null,null,null,null,null,null,null,null,null,null,null,null,null,null,null,null,null,null,null,null,null,null,null,null,null,null,null,null,null,null,null,null,null,null,null,null,null,null,null,null,null,null,null,null,null,null,null,null,"","","","","","","","","","","","",null,null,null,null,null,null,null,null,0,0,0,0,0,0,0,0,0,0,0,0]
["DEMENCIAS (INCLUYE ALZHEIMER)","LEVE",0,{"$f":"+F41+H41+J41+L41+N41+P41+R41+T41+V41+X41+Z41+AB41+AD41+AF41+AH41+AJ41+AL41","v":0},{"$f":"+G41+I41+K41+M41+O41+Q41+S41+U41+W41+Y41+AA41+AC41+AE41+AG41+AI41+AK41+AM41","v":0},null,null,null,null,null,null,null,null,null,null,null,null,null,null,null,null,null,null,null,null,null,null,null,null,null,null,null,null,null,null,null,null,null,null,null,null,null,null,null,null,null,null,null,null,null,null,null,null,null,null,null,null,null,null,null,null,null,null,null,null,null,null,null,null,null,null,null,null,null,null,null,null,null,null,null,null,null,null,null,"","","","","","","",null,null,"","","",null,null,null,null,null,null,null,null,0,0,0,0,0,0,0,null,null,0,0,0]
[null,"MODERADO",0,0,0,null,null,null,null,null,null,null,null,null,null,null,null,null,null,null,null,null,null,null,null,null,null,null,null,null,null,null,null,null,null,null,null,null,null,null,null,null,null,null,null,null,null,null,null,null,null,null,null,null,null,null,null,null,null,null,null,null,null,null,null,null,null,null,null,null,null,null,null,null,null,null,null,null,null,null,null,null,null,null,"","","","","","","",null,null,"","","",null,null,null,null,null,null,null,null,0,0,0,0,0,0,0,null,null,0,0,0]
[null,"AVANZADO",0,0,0,null,null,null,null,null,null,null,null,null,null,null,null,null,null,null,null,null,null,null,null,null,null,null,null,null,null,null,null,null,null,null,null,null,null,null,null,null,null,null,null,null,null,null,null,null,null,null,null,null,null,null,null,null,null,null,null,null,null,null,null,null,null,null,null,null,null,null,null,null,null,null,null,null,null,null,null,null,null,null,"","","","","","","",null,null,"","","",null,null,null,null,null,null,null,null,0,0,0,0,0,0,0,null,null,0,0,0]
["ESQUIZOFRENIA"]
["PSICOSIS",null,0,0,0,null,null,null,null,null,null,null,null,null,null,null,null,null,null,null,null,null,null,null,null,null,null,null,null,null,null,null,null,null,null,null,null,null,null,null,null,null,null,null,null,null,null,null,null,null,null,null,null,null,null,null,null,null,null,null,null,null,null,null,null,null,null,null,null,null,null,null,null,null,null,null,null,null,null,null,null,null,null,null,"","","","","","","","","","","","",null,null,null,null,null,null,null,null,0,0,0,0,0,0,0,0,0,0,0,0]
["TRASTORNO ADAPTATIVO",null,0,0,0]
["PRIMER EPISODIO ESQUIZOFRENIA CON OCUPACION REGULAR",null,{"$f":"SUM(D47:E47)","v":0},0,0,null,null,null,null,null,null,null,null,null,null,null,null,null,null,null,null,null,null,null,null,null,null,null,null,null,null,null,null,null,null,null,null,null,null,null,null,null,null,null,null,null,null,null,null,null,null,null,null,null,null,null,null,null,null,null,null,null,null,null,null,null,null,null,null,null,null,null,null,null,null,null,null,null,null,null,null,null,null,null,"","","","","","","","","","","","",null,null,null,null,null,null,null,null,0,0,0,0,0,0,0,0,0,0,0,0]
["TRASTORNOS DE LA CONDUCTA ALIMENTARIA",null,0,0,0,null,null,null,null,null,null,null,null,null,null,null,null,null,null,null,null,null,null,null,null,null,null,null,null,null,null,null,null,null,null,null,null,null,null,null,null,null,null,null,null,null,null,null,null,null,null,null,null,null,null,null,null,null,null,null,null,null,null,null,null,null,null,null,null,null,null,null,null,null,null,null,null,null,null,null,null,null,null,null,"","","","","","","","","","","","",null,null,null,null,null,null,null,null,0,0,0,0,0,0,0,0,0,0,0,0]
["RETRASO MENTAL",null,0,0,0,null,null,null,null,null,null,null,null,null,null,null,null,null,null,null,null,null,null,null,null,null,null,null,null,null,null,null,null,null,null,null,null,null,null,null,null,null,null,null,null,null,null,null,null,null,null,null,null,null,null,null,null,null,null,null,null,null,null,null,null,null,null,null,null,null,null,null,null,null,null,null,null,null,null,null,null,null,null,null,"","","","","","","","","","","","",null,null,null,null,null,null,null,null,0,0,0,0,0,0,0,0,0,0,0,0]
["TRASTORNO DE PERSONALIDAD",null,0,0,0,null,null,null,null,null,null,null,null,null,null,null,null,null,null,null,null,null,null,null,null,null,null,null,null,null,null,null,null,null,null,null,null,null,null,null,null,null,null,null,null,null,null,null,null,null,null,null,null,null,null,null,null,null,null,null,null,null,null,null,null,null,null,null,null,null,null,null,null,null,null,null,null,null,null,null,null,null,null,null,"","","","","","","","","","","","",null,null,null,null,null,null,null,null,0,0,0,0,0,0,0,0,0,0,0,0]
["TRASTORNO GENERALIZADOS DEL DESARROLLO","AUTISMO",{"$f":"SUM(D51:E51)","v":0},{"$f":"+F51+H51+J51+L51+N51+P51+R51+T51+V51+X51+Z51+AB51+AD51+AF51+AH51+AJ51+AL51","v":0},{"$f":"+G51+I51+K51+M51+O51+Q51+S51+U51+W51+Y51+AA51+AC51+AE51+AG51+AI51+AK51+AM51","v":0}]
[null,"ASPERGER",0,{"$f":"+F52+H52+J52+L52+N52+P52+R52+T52+V52+X52+Z52+AB52+AD52+AF52+AH52+AJ52+AL52","v":0},{"$f":"+G52+I52+K52+M52+O52+Q52+S52+U52+W52+Y52+AA52+AC52+AE52+AG52+AI52+AK52+AM52","v":0}]
[null,"SÍNDROME DE RETT",0,0,0]
[null,"TRASTORNO DESINTEGRATIVO DE LA INFANCIA",0,0,0]
[null,"TRASTONO GENERALIZADO DEL DESARROLLO NO ESPECÍFICO",0,0,0,null,null,null,null,null,null,null,null,null,null,null,null,null,null,null,null,null,null,null,null,null,null,null,null,null,null,null,null,null,null,null,null,null,null,null,null,null,null,null,null,null,null,null,null,null,null,null,null,null,null,null,null,null,null,null,null,null,null,null,null,null,null,null,null,null,null,null,null,null,null,null,null,null,null,null,null,null,null,null,"","","","","","","","","","","","",null,null,null,null,null,null,null,null,0,0,0,0,0,0,0,0,0,0,0,0]
["EPILEPSIA",null,{"$f":"SUM(D56:E56)","v":0},0,0,null,null,null,null,null,null,null,null,null,null,null,null,null,null,null,null,null,null,null,null,null,null,null,null,null,null,null,null,null,null,null,null,null,null,null,null,null,null,null,null,null,null,null,null,null,null,null,null,null,null,null,null,null,null,null,null,null,null,null,null,null,null,null,null,null,null,null,null,null,null,null,null,null,null,null,null,null,null,null,"","","","","","","","","","","","",null,null,null,null,null,null,null,null,0,0,0,0,0,0,0,0,0,0,0,0]
["OTRAS ",null,{"$f":"SUM(D57:E57)","v":0},0,0,null,null,null,null,null,null,null,null,null,null,null,null,null,null,null,null,null,null,null,null,null,null,null,null,null,null,null,null,null,null,null,null,null,null,null,null,null,null,null,null,null,null,null,null,null,null,null,null,null,null,null,null,null,null,null,null,null,null,null,null,null,null,null,null,null,null,null,null,null,null,null,null,null,null,null,null,null,null,null,null,null,"","","","","",null,null,"","","",null,null,null,null,null,null,null,null,null,null,0,0,0,0,0,null,null,0,0,0]
["SECCION A.2: PROGRAMA DE REHABILITACIÓN EN ATENCION PRIMARIA (PERSONAS CON TRANSTORNOS PSIQUIÁTRICO)."]
["TIPO","RUBRO","T O T A L",null,null,"GRUPO DE EDAD (en años)"]
[null,null,null,null,null,"0 a 4 años",null,"5 a 9 años",null,"10 a 14 años",null,"15 a 19 años",null,"20 a 24 años",null,"25 a 29 años",null,"30 a 34 años",null,"35 a 39 años",null,"40 a 44 años",null,"45 a 49 años",null,"50 a 54 años",null,"55 a 59 años",null,"60 a 64 años",null,"65 a 69 años",null,"70 a 74 años",null,"75 a 79 años",null,"80 y más años"]
[null,null,"Ambos\nsexos","Hombres","Mujeres","Hombres","Mujeres","Hombres","Mujeres","Hombres","Mujeres","Hombres","Mujeres","Hombres","Mujeres","Hombres","Mujeres","Hombres","Mujeres","Hombres","Mujeres","Hombres","Mujeres","Hombres","Mujeres","Hombres","Mujeres","Hombres","Mujeres","Hombres","Mujeres","Hombres","Mujeres","Hombres","Mujeres","Hombres","Mujeres","Hombres","Mujeres"]
["PROGRAMA DE REHABILITACIÓN TIPO I","NÚMERO DE PERSONAS EN CONTROL EN EL PROGRAMA",{"$f":"SUM(D62:E62)","v":0},{"$f":"+F62+H62+J62+L62+N62+P62+R62+T62+V62+X62+Z62+AB62+AD62+AF62+AH62+AJ62+AL62","v":0},{"$f":"+G62+I62+K62+M62+O62+Q62+S62+U62+W62+Y62+AA62+AC62+AE62+AG62+AI62+AK62+AM62","v":0}]
["PROGRAMA DE REHABILITACIÓN TIPO II","NÚMERO DE PERSONAS EN CONTROL EN EL PROGRAMA",{"$f":"SUM(D63:E63)","v":0},{"$f":"+F63+H63+J63+L63+N63+P63+R63+T63+V63+X63+Z63+AB63+AD63+AF63+AH63+AJ63+AL63","v":0},{"$f":"+G63+I63+K63+M63+O63+Q63+S63+U63+W63+Y63+AA63+AC63+AE63+AG63+AI63+AK63+AM63","v":0}]
["SECCION A.3: PROGRAMA DE ACOMPAÑAMIENTO PSICOSOCIAL EN LA ATENCION PRIMARIA"]
["CONCEPTO",null,"TOTAL",null,null,"GRUPOS DE EDAD (en años)",null,null,null,null,null,null,null,null,null,"Población Migrantes"]
[null,null,null,null,null,"0 a 4 años",null,"5 a 9 años",null,"10 a 14 años",null,"15 a 19 años",null,"20 a 24 años"]
[null,null,"Ambos Sexos","Hombres","Mujeres","Hombres","Mujeres","Hombres","Mujeres","Hombres","Mujeres","Hombres","Mujeres","Hombres","Mujeres","Hombres","Mujeres"]
["N° DE PERSONAS EN CONTROL EN PROGRAMA DE ACOMPAÑAMIENTO PSICOSOCIAL",null,{"$f":"SUM(D68:E68)","v":0},{"$f":"+F68+H68+J68+L68+N68","v":0},{"$f":"+G68+I68+K68+M68+O68","v":0}]
["B. ATENCIÓN DE ESPECIALIDADES\nSECCION B.1: POBLACIÓN EN CONTROL EN ESPECIALIDAD AL CORTE"]
["CONCEPTO",null,"T O T A L",null,null,"GRUPO DE EDAD (en años)",null,null,null,null,null,null,null,null,null,null,null,null,null,null,null,null,null,null,null,null,null,null,null,null,null,null,null,null,null,null,null,null,null,"Gestantes","Madre de Hijo menor de 5 años ","Pueblos Originarios",null,"Población Migrantes",null,"Niños, Niñas, Adolescentes y Jóvenes Mejor Niñez","Plan Cuidado Integral Elaborado","TRANS"]
[null,null,null,null,null,"0 a 4 años",null,"5 a 9 años",null,"10 a 14 años",null,"15 a 19 años",null,"20 a 24 años",null,"25 a 29 años",null,"30 a 34 años",null,"35 a 39 años",null,"40 a 44 años",null,"45 a 49 años",null,"50 a 54 años",null,"55 a 59 años",null,"60 a 64 años",null,"65 a 69 años",null,"70 a 74 años",null,"75 a 79 años",null,"80 y más años",null,null,null,null,null,null,null,null,null,null,null,null,null,null,null,null,null,null,null,null,null,null,null,null,null,null,null,null,null,null,null,null,null,null,null,null,null,null,null,null,null,null,null,null,null,"Gestantes","Madre de hijos","Pueblos originarios","Pueblos originarios","Poblacion Migrantes","Poblacion Migrantes","Población SENAME","Gestantes","Madre de hijos",null,"Pueblos originarios","Poblacion Migrantes","Población SENAME",null,"Plan Cuidado Integral Elaborado","PCIE",null,null,null,null,"Gestantes","Madre de hojos","Pueblos originarios","Pueblos originarios","Poblacion Migrantes","Poblacion Migrantes","Poblacion SENAME","Gestantes","Madre de hijos",null,"Pueblos originarios","Poblacion Migrantes","Poblacion SENAME",null,"Plan Cuidado Integral Elaborado","Plan Cuidado Integral Elaborado"]
[null,null,"Ambos\nsexos","Hombres","Mujeres","Hombres","Mujeres","Hombres","Mujeres","Hombres","Mujeres","Hombres","Mujeres","Hombres","Mujeres","Hombres","Mujeres","Hombres","Mujeres","Hombres","Mujeres","Hombres","Mujeres","Hombres","Mujeres","Hombres","Mujeres","Hombres","Mujeres","Hombres","Mujeres","Hombres ","Mujeres","Hombres ","Mujeres","Hombres ","Mujeres","Hombres","Mujeres",null,null,"Hombres","Mujeres","Hombres","Mujeres",null,null,null,null,null,null,null,null,null,null,null,null,null,null,null,null,null,null,null,null,null,null,null,null,null,null,null,null,null,null,null,null,null,null,null,null,null,null,null,null,"Hombres","Mujeres","Hombres","Mujeres",null,"No Olvide","No Olvide",null,"No Olvide","No Olvide","No Olvide",null,null,"No Olvide",null,null,null,null,null,null,"Hombres","Mujeres","Hombres","Mujeres",null,"No Olvide","No Olvide",null,"No Olvide","No Olvide","No Olvide",null,null,"No Olvide"]
["NUMERO DE PERSONAS EN CONTROL EN EL PROGRAMA",null,{"$f":"SUM(D73:E73)","v":0},{"$f":"+F73+H73+J73+L73+N73+P73+R73+T73+V73+X73+Z73+AB73+AD73+AF73+AH73+AJ73+AL73","v":0},{"$f":"+G73+I73+K73+M73+O73+Q73+S73+U73+W73+Y73+AA73+AC73+AE73+AG73+AI73+AK73+AM73","v":0},null,null,null,null,null,null,null,null,null,null,null,null,null,null,null,null,null,null,null,null,null,null,null,null,null,null,null,null,null,null,null,null,null,null,null,null,null,null,null,null,null,null,null,null,null,null,null,null,null,null,null,null,null,null,null,null,null,null,null,null,null,null,null,null,null,null,null,null,null,null,null,null,null,null,null,null,null,null,{"$f":"IF($AN73>$E73,\"* La celda 'Gestantes' debe ser menor o igual al Total de Mujeres en control. \",\"\")","v":""},{"$f":"IF($AO73>$E73,\"* La celda 'Madres de Hijos menor de 5 años' debe ser menor o igual al Total de Mujeres en control. \",\"\")","v":""},{"$f":"IF(($AP73)>$D73,\"* La celda 'Pueblos Originarios / Hombres' debe ser menor o igual al Total de Hombres en control. \",\"\")","v":""},{"$f":"IF($AQ73>$E73,\"* La celda 'Pueblos Originarios / Mujeres' debe ser menor o igual al Total de Mujeres en control. \",\"\")","v":""},{"$f":"IF(($AR73)>$D73,\"* La celda 'Población Migrantes / Hombres' debe ser menor o igual al Total de Hombres en control. \",\"\")","v":""},{"$f":"IF($AS73>$E73,\"* La celda 'Población Migrantes / Mujeres' debe ser menor o igual al Total de Mujeres en control. \",\"\")","v":""},{"$f":"IF($AT73>$C73,\"* La celda 'Población SENAME' debe ser menor o igual al Total de Personas en control. \",\"\")","v":""},{"$f":"IF(AND($C73<>0,$AN73=\"\"),\"* No olvide escribir en la celda de 'Gestantes' (Digite CERO si no tiene). \",\"\")","v":""},{"$f":"IF(AND($C73<>0,$AO73=\"\"),\"* No olvide escribir en la celda de 'Madres de Hijos menor de 5 años' (Digite CERO si no tiene). \",\"\")","v":""},null,{"$f":"IF(AND($D73<>0,$AP73=\"\"),\"* No olvide escribir en las celdas de 'Pueblos Originarios' (Digite CERO si no tiene). \",IF(AND($E73<>0,$AQ73=\"\"),\"* No olvide escribir en las celdas de 'Pueblos Originarios' (Digite CERO si no tiene). \",\"\"))","v":""},{"$f":"IF(AND($D73<>0,$AR73=\"\"),\"* No olvide escribir en las celdas de 'Población Migrantes' (Digite CERO si no tiene). \",IF(AND($E73<>0,$AS73=\"\"),\"* No olvide escribir en las celdas de 'Población Migrantes' (Digite CERO si no tiene). \",\"\"))","v":""},{"$f":"IF(AND($C73<>0,$AT73=\"\"),\"* No olvide escribir en las celdas de 'Población SENAME' (Digite CERO si no tiene). \",\"\")","v":""},null,{"$f":"IF($AU73>$C73,\"* La celda 'Plan Cuidado Integral Elaborado' debe ser menor o igual al Total de Personas en control. \",\"\")","v":""},{"$f":"IF(AND($C73<>0,$AU73=\"\"),\"* No olvide escribir en las celdas de 'Plan Cuidado Integral Elaborado' (Digite CERO si no tiene). \",\"\")","v":""},null,null,null,null,{"$f":"IF($AN73>$E73,1,0)","v":0},{"$f":"IF($AO73>$E73,1,0)","v":0},{"$f":"IF(($AP73)>$D73,1,0)","v":0},{"$f":"IF($AQ73>$E73,1,0)","v":0},{"$f":"IF(($AR73)>$D73,1,0)","v":0},{"$f":"IF($AS73>$E73,1,0)","v":0},{"$f":"IF($AT73>$C73,1,0)","v":0},{"$f":"IF(AND($C73<>0,$AN73=\"\"),1,0)","v":0},{"$f":"IF(AND($C73<>0,$AO73=\"\"),1,0)","v":0},null,{"$f":"IF(AND($D73<>0,$AP73=\"\"),1,IF(AND($E73<>0,$AQ73=\"\"),1,0))","v":0},{"$f":"IF(AND($D73<>0,$AR73=\"\"),1,IF(AND($E73<>0,$AS73=\"\"),1,0))","v":0},{"$f":"IF(AND($C73<>0,$AT73=\"\"),1,0)","v":0},null,{"$f":"IF($AU73>$C73,1,0)","v":0},{"$f":"IF(AND($C73<>0,$AU73=\"\"),1,0)","v":0}]
["FACTORES DE RIESGO Y CONDICIONANTES DE LA SALUD MENTAL"]
["VIOLENCIA ","VICTIMA",{"$f":"SUM(D75:E75)","v":0},{"$f":"+F75+H75+J75+L75+N75+P75+R75+T75+V75+X75+Z75+AB75+AD75+AF75+AH75+AJ75+AL75","v":0},{"$f":"+G75+I75+K75+M75+O75+Q75+S75+U75+W75+Y75+AA75+AC75+AE75+AG75+AI75+AK75+AM75","v":0},null,null,null,null,null,null,null,null,null,null,null,null,null,null,null,null,null,null,null,null,null,null,null,null,null,null,null,null,null,null,null,null,null,null,null,null,null,null,null,null,null,null,null,null,null,null,null,null,null,null,null,null,null,null,null,null,null,null,null,null,null,null,null,null,null,null,null,null,null,null,null,null,null,null,null,null,null,null,{"$f":"IF($AN75>$E75,\"* La celda 'Gestantes' debe ser menor o igual al Total de Mujeres en control. \",\"\")","v":""},{"$f":"IF($AO75>$E75,\"* La celda 'Madres de Hijos menor de 5 años' debe ser menor o igual al Total de Mujeres en control. \",\"\")","v":""},{"$f":"IF(($AP75)>$D75,\"* La celda 'Pueblos Originarios / Hombres' debe ser menor o igual al Total de Hombres en control. \",\"\")","v":""},{"$f":"IF($AQ75>$E75,\"* La celda 'Pueblos Originarios / Mujeres' debe ser menor o igual al Total de Mujeres en control. \",\"\")","v":""},{"$f":"IF(($AR75)>$D75,\"* La celda 'Población Migrantes / Hombres' debe ser menor o igual al Total de Hombres en control. \",\"\")","v":""},{"$f":"IF($AS75>$E75,\"* La celda 'Población Migrantes / Mujeres' debe ser menor o igual al Total de Mujeres en control. \",\"\")","v":""},{"$f":"IF($AT75>$C75,\"* La celda 'Población SENAME' debe ser menor o igual al Total de Personas en control. \",\"\")","v":""},{"$f":"IF(AND($C75<>0,$AN75=\"\"),\"* No olvide escribir en la celda de 'Gestantes' (Digite CERO si no tiene). \",\"\")","v":""},{"$f":"IF(AND($C75<>0,$AO75=\"\"),\"* No olvide escribir en la celda de 'Madres de Hijos menor de 5 años' (Digite CERO si no tiene). \",\"\")","v":""},null,{"$f":"IF(AND($D75<>0,$AP75=\"\"),\"* No olvide escribir en las celdas de 'Pueblos Originarios' (Digite CERO si no tiene). \",IF(AND($E75<>0,$AQ75=\"\"),\"* No olvide escribir en las celdas de 'Pueblos Originarios' (Digite CERO si no tiene). \",\"\"))","v":""},{"$f":"IF(AND($D75<>0,$AR75=\"\"),\"* No olvide escribir en las celdas de 'Población Migrantes' (Digite CERO si no tiene). \",IF(AND($E75<>0,$AS75=\"\"),\"* No olvide escribir en las celdas de 'Población Migrantes' (Digite CERO si no tiene). \",\"\"))","v":""},{"$f":"IF(AND($C75<>0,$AT75=\"\"),\"* No olvide escribir en las celdas de 'Población SENAME' (Digite CERO si no tiene). \",\"\")","v":""},null,{"$f":"IF($AU75>$C75,\"* La celda 'Plan Cuidado Integral Elaborado' debe ser menor o igual al Total de Personas en control. \",\"\")","v":""},{"$f":"IF(AND($C75<>0,$AU75=\"\"),\"* No olvide escribir en las celdas de 'Plan Cuidado Integral Elaborado' (Digite CERO si no tiene). \",\"\")","v":""},null,null,null,null,{"$f":"IF($AN75>$E75,1,0)","v":0},{"$f":"IF($AO75>$E75,1,0)","v":0},{"$f":"IF(($AP75)>$D75,1,0)","v":0},{"$f":"IF($AQ75>$E75,1,0)","v":0},{"$f":"IF(($AR75)>$D75,1,0)","v":0},{"$f":"IF($AS75>$E75,1,0)","v":0},{"$f":"IF($AT75>$C75,1,0)","v":0},{"$f":"IF(AND($C75<>0,$AN75=\"\"),1,0)","v":0},{"$f":"IF(AND($C75<>0,$AO75=\"\"),1,0)","v":0},null,{"$f":"IF(AND($D75<>0,$AP75=\"\"),1,IF(AND($E75<>0,$AQ75=\"\"),1,0))","v":0},{"$f":"IF(AND($D75<>0,$AR75=\"\"),1,IF(AND($E75<>0,$AS75=\"\"),1,0))","v":0},{"$f":"IF(AND($C75<>0,$AT75=\"\"),1,0)","v":0},null,{"$f":"IF($AU75>$C75,1,0)","v":0},{"$f":"IF(AND($C75<>0,$AU75=\"\"),1,0)","v":0}]
[null,"AGRESOR/A",0,0,0,null,null,null,null,null,null,null,null,null,null,null,null,null,null,null,null,null,null,null,null,null,null,null,null,null,null,null,null,null,null,null,null,null,null,null,null,null,null,null,null,null,null,null,null,null,null,null,null,null,null,null,null,null,null,null,null,null,null,null,null,null,null,null,null,null,null,null,null,null,null,null,null,null,null,null,null,null,null,"",{"$f":"IF($AO76>$E76,\"* La celda 'Madres de Hijos menor de 5 años' debe ser menor o igual al Total de Mujeres en control. \",\"\")","v":""},"",{"$f":"IF($AQ76>$E76,\"* La celda 'Pueblos Originarios / Mujeres' debe ser menor o igual al Total de Mujeres en control. \",\"\")","v":""},"",{"$f":"IF($AS76>$E76,\"* La celda 'Población Migrantes / Mujeres' debe ser menor o igual al Total de Mujeres en control. \",\"\")","v":""},"","",{"$f":"IF(AND($C76<>0,$AO76=\"\"),\"* No olvide escribir en la celda de 'Madres de Hijos menor de 5 años' (Digite CERO si no tiene). \",\"\")","v":""},null,"","","",null,{"$f":"IF($AU76>$C76,\"* La celda 'Plan Cuidado Integral Elaborado' debe ser menor o igual al Total de Personas en control. \",\"\")","v":""},"",null,null,null,null,0,{"$f":"IF($AO76>$E76,1,0)","v":0},0,{"$f":"IF($AQ76>$E76,1,0)","v":0},0,{"$f":"IF($AS76>$E76,1,0)","v":0},0,0,0,null,0,0,0,null,0,0]
["ABUSO SEXUAL",null,0,0,0,null,null,null,null,null,null,null,null,null,null,null,null,null,null,null,null,null,null,null,null,null,null,null,null,null,null,null,null,null,null,null,null,null,null,null,null,null,null,null,null,null,null,null,null,null,null,null,null,null,null,null,null,null,null,null,null,null,null,null,null,null,null,null,null,null,null,null,null,null,null,null,null,null,null,null,null,null,null,"",{"$f":"IF($AO77>$E77,\"* La celda 'Madres de Hijos menor de 5 años' debe ser menor o igual al Total de Mujeres en control. \",\"\")","v":""},"",{"$f":"IF($AQ77>$E77,\"* La celda 'Pueblos Originarios / Mujeres' debe ser menor o igual al Total de Mujeres en control. \",\"\")","v":""},"",{"$f":"IF($AS77>$E77,\"* La celda 'Población Migrantes / Mujeres' debe ser menor o igual al Total de Mujeres en control. \",\"\")","v":""},"","",{"$f":"IF(AND($C77<>0,$AO77=\"\"),\"* No olvide escribir en la celda de 'Madres de Hijos menor de 5 años' (Digite CERO si no tiene). \",\"\")","v":""},null,"","","",null,"","",null,null,null,null,0,{"$f":"IF($AO77>$E77,1,0)","v":0},0,{"$f":"IF($AQ77>$E77,1,0)","v":0},0,{"$f":"IF($AS77>$E77,1,0)","v":0},0,0,0,null,0,0,0,null,0,0]
["SUICIDIO","IDEACIÓN",{"$f":"SUM(D78:E78)","v":0},{"$f":"+H78+J78+L78+N78+P78+R78+T78+V78+X78+Z78+AB78+AD78+AF78+AH78+AJ78+AL78","v":0},{"$f":"+I78+K78+M78+O78+Q78+S78+U78+W78+Y78+AA78+AC78+AE78+AG78+AI78+AK78+AM78","v":0},null,null,null,null,null,null,null,null,null,null,null,null,null,null,null,null,null,null,null,null,null,null,null,null,null,null,null,null,null,null,null,null,null,null,null,null,null,null,null,null,null,null,null,null,null,null,null,null,null,null,null,null,null,null,null,null,null,null,null,null,null,null,null,null,null,null,null,null,null,null,null,null,null,null,null,null,null,null,"",{"$f":"IF($AO78>$E78,\"* La celda 'Madres de Hijos menor de 5 años' debe ser menor o igual al Total de Mujeres en control. \",\"\")","v":""},"",{"$f":"IF($AQ78>$E78,\"* La celda 'Pueblos Originarios / Mujeres' debe ser menor o igual al Total de Mujeres en control. \",\"\")","v":""},"",{"$f":"IF($AS78>$E78,\"* La celda 'Población Migrantes / Mujeres' debe ser menor o igual al Total de Mujeres en control. \",\"\")","v":""},"","",{"$f":"IF(AND($C78<>0,$AO78=\"\"),\"* No olvide escribir en la celda de 'Madres de Hijos menor de 5 años' (Digite CERO si no tiene). \",\"\")","v":""},null,"","","",null,"","",null,null,null,null,0,{"$f":"IF($AO78>$E78,1,0)","v":0},0,{"$f":"IF($AQ78>$E78,1,0)","v":0},0,{"$f":"IF($AS78>$E78,1,0)","v":0},0,0,0,null,0,0,0,null,0,0]
[null,"INTENTO",{"$f":"SUM(D79:E79)","v":0},{"$f":"+H79+J79+L79+N79+P79+R79+T79+V79+X79+Z79+AB79+AD79+AF79+AH79+AJ79+AL79","v":0},{"$f":"+I79+K79+M79+O79+Q79+S79+U79+W79+Y79+AA79+AC79+AE79+AG79+AI79+AK79+AM79","v":0},null,null,null,null,null,null,null,null,null,null,null,null,null,null,null,null,null,null,null,null,null,null,null,null,null,null,null,null,null,null,null,null,null,null,null,null,null,null,null,null,null,null,null,null,null,null,null,null,null,null,null,null,null,null,null,null,null,null,null,null,null,null,null,null,null,null,null,null,null,null,null,null,null,null,null,null,null,null,"",{"$f":"IF($AO79>$E79,\"* La celda 'Madres de Hijos menor de 5 años' debe ser menor o igual al Total de Mujeres en control. \",\"\")","v":""},"",{"$f":"IF($AQ79>$E79,\"* La celda 'Pueblos Originarios / Mujeres' debe ser menor o igual al Total de Mujeres en control. \",\"\")","v":""},"",{"$f":"IF($AS79>$E79,\"* La celda 'Población Migrantes / Mujeres' debe ser menor o igual al Total de Mujeres en control. \",\"\")","v":""},"","",{"$f":"IF(AND($C79<>0,$AO79=\"\"),\"* No olvide escribir en la celda de 'Madres de Hijos menor de 5 años' (Digite CERO si no tiene). \",\"\")","v":""},null,"","","",null,"","",null,null,null,null,0,{"$f":"IF($AO79>$E79,1,0)","v":0},0,{"$f":"IF($AQ79>$E79,1,0)","v":0},0,{"$f":"IF($AS79>$E79,1,0)","v":0},0,0,0,null,0,0,0,null,0,0]
["PERSONAS CON DIAGNOSTICOS DE TRASTORNOS MENTALES ",null,0,0,0,null,null,null,null,null,null,null,null,null,null,null,null,null,null,null,null,null,null,null,null,null,null,null,null,null,null,null,null,null,null,null,null,null,null,null,null,null,null,null,null,null,null,null,null,null,null,null,null,null,null,null,null,null,null,null,null,null,null,null,null,null,null,null,null,null,null,null,null,null,null,null,null,null,null,null,null,null,null,"",{"$f":"IF($AO80>$E80,\"* La celda 'Madres de Hijos menor de 5 años' debe ser menor o igual al Total de Mujeres en control. \",\"\")","v":""},"",{"$f":"IF($AQ80>$E80,\"* La celda 'Pueblos Originarios / Mujeres' debe ser menor o igual al Total de Mujeres en control. \",\"\")","v":""},"",{"$f":"IF($AS80>$E80,\"* La celda 'Población Migrantes / Mujeres' debe ser menor o igual al Total de Mujeres en control. \",\"\")","v":""},"","",{"$f":"IF(AND($C80<>0,$AO80=\"\"),\"* No olvide escribir en la celda de 'Madres de Hijos menor de 5 años' (Digite CERO si no tiene). \",\"\")","v":""},null,"","","",null,"","",null,null,null,null,0,{"$f":"IF($AO80>$E80,1,0)","v":0},0,{"$f":"IF($AQ80>$E80,1,0)","v":0},0,{"$f":"IF($AS80>$E80,1,0)","v":0},0,0,0,null,0,0,0,null,0,0]
["TRASTORNOS DEL HUMOR\n(AFECTIVOS)","DEPRESIÓN REFRACTARIA",{"$f":"SUM(D81:E81)","v":0},0,0,null,null,null,null,null,null,null,null,null,null,null,null,null,null,null,null,null,null,null,null,null,null,null,null,null,null,null,null,null,null,null,null,null,null,null,null,null,null,null,null,null,null,null,null,null,null,null,null,null,null,null,null,null,null,null,null,null,null,null,null,null,null,null,null,null,null,null,null,null,null,null,null,null,null,null,null,null,null,"","","","","","","","","",null,"","","",null,"","",null,null,null,null,0,0,0,0,0,0,0,0,0,null,0,0,0,null,0,0]
[null,"DEPRESIÓN GRAVE CON PSICOSIS",0,0,0,null,null,null,null,null,null,null,null,null,null,null,null,null,null,null,null,null,null,null,null,null,null,null,null,null,null,null,null,null,null,null,null,null,null,null,null,null,null,null,null,null,null,null,null,null,null,null,null,null,null,null,null,null,null,null,null,null,null,null,null,null,null,null,null,null,null,null,null,null,null,null,null,null,null,null,null,null,null,"","","","","","","","","",null,"","","",null,"","",null,null,null,null,0,0,0,0,0,0,0,0,0,null,0,0,0,null,0,0]
[null,"DEPRESIÓN CON ALTO RIESGO SUICIDA",0,0,0,null,null,null,null,null,null,null,null,null,null,null,null,null,null,null,null,null,null,null,null,null,null,null,null,null,null,null,null,null,null,null,null,null,null,null,null,null,null,null,null,null,null,null,null,null,null,null,null,null,null,null,null,null,null,null,null,null,null,null,null,null,null,null,null,null,null,null,null,null,null,null,null,null,null,null,null,null,null,"","","","","","","","","",null,"","","",null,"","",null,null,null,null,0,0,0,0,0,0,0,0,0,null,0,0,0,null,0,0]
[null,"DEPRESIÓN POST PARTO",{"$f":"SUM(D84:E84)","v":0},null,{"$f":"K84+M84+O84+Q84+S84+U84+W84+Y84+AA84+AC84","v":0},null,null,null,null,null,null,null,null,null,null,null,null,null,null,null,null,null,null,null,null,null,null,null,null,null,null,null,null,null,null,null,null,null,null,null,null,null,null,null,null,null,null,null,null,null,null,null,null,null,null,null,null,null,null,null,null,null,null,null,null,null,null,null,null,null,null,null,null,null,null,null,null,null,null,null,null,null,null,null,"",null,"",null,"",{"$f":"IF($AT84>$E84,\"* La celda 'Población SENAME' debe ser menor o igual al Total de Mujeres en control. \",\"\")","v":""},null,"",null,{"$f":"IF(AND($E84<>0,$AQ84=\"\"),\"* No olvide escribir en las celdas de 'Pueblos Originarios / Mujeres' (Digite CERO si no tiene). \",\"\")","v":""},{"$f":"IF(AND($E84<>0,$AS84=\"\"),\"* No olvide escribir en las celdas de ''Población Migrantes / Mujeres' (Digite CERO si no tiene). \",\"\")","v":""},{"$f":"IF(AND($E84<>0,$AT84=\"\"),\"* No olvide escribir en las celdas de 'Población SENAME' (Digite CERO si no tiene). \",\"\")","v":""},null,"","",null,null,null,null,null,0,null,0,null,0,{"$f":"IF($AT84>$E84,1,0)","v":0},null,{"$f":"IF(AND($E84<>0,$AO84=\"\"),1,0)","v":0},null,{"$f":"IF(AND($E84<>0,$AQ84=\"\"),1,0)","v":0},{"$f":"IF(AND($E84<>0,$AS84=\"\"),1,0)","v":0},0,null,0,0]
[null,"TRASTORNO BIPOLAR",{"$f":"SUM(D85:E85)","v":0},{"$f":"+F85+H85+J85+L85+N85+P85+R85+T85+V85+X85+Z85+AB85+AD85+AF85+AH85+AJ85+AL85","v":0},0,null,null,null,null,null,null,null,null,null,null,null,null,null,null,null,null,null,null,null,null,null,null,null,null,null,null,null,null,null,null,null,null,null,null,null,null,null,null,null,null,null,null,null,null,null,null,null,null,null,null,null,null,null,null,null,null,null,null,null,null,null,null,null,null,null,null,null,null,null,null,null,null,null,null,null,null,null,null,{"$f":"IF($AN85>$E85,\"* La celda 'Gestantes' debe ser menor o igual al Total de Mujeres en control. \",\"\")","v":""},"",{"$f":"IF(($AP85)>$D85,\"* La celda 'Pueblos Originarios / Hombres' debe ser menor o igual al Total de Hombres en control. \",\"\")","v":""},"",{"$f":"IF(($AR85)>$D85,\"* La celda 'Población Migrantes / Hombres' debe ser menor o igual al Total de Hombres en control. \",\"\")","v":""},"",{"$f":"IF($AT85>$C85,\"* La celda 'Población SENAME' debe ser menor o igual al Total de Personas en control. \",\"\")","v":""},{"$f":"IF(AND($C85<>0,$AN85=\"\"),\"* No olvide escribir en la celda de 'Gestantes' (Digite CERO si no tiene). \",\"\")","v":""},"",null,{"$f":"IF(AND($D85<>0,$AP85=\"\"),\"* No olvide escribir en las celdas de 'Pueblos Originarios' (Digite CERO si no tiene). \",IF(AND($E85<>0,$AQ85=\"\"),\"* No olvide escribir en las celdas de 'Pueblos Originarios' (Digite CERO si no tiene). \",\"\"))","v":""},{"$f":"IF(AND($D85<>0,$AR85=\"\"),\"* No olvide escribir en las celdas de 'Población Migrantes' (Digite CERO si no tiene). \",IF(AND($E85<>0,$AS85=\"\"),\"* No olvide escribir en las celdas de 'Población Migrantes' (Digite CERO si no tiene). \",\"\"))","v":""},{"$f":"IF(AND($C85<>0,$AT85=\"\"),\"* No olvide escribir en las celdas de 'Población SENAME' (Digite CERO si no tiene). \",\"\")","v":""},null,"","",null,null,null,null,{"$f":"IF($AN85>$E85,1,0)","v":0},0,{"$f":"IF(($AP85)>$D85,1,0)","v":0},0,{"$f":"IF(($AR85)>$D85,1,0)","v":0},0,{"$f":"IF($AT85>$C85,1,0)","v":0},{"$f":"IF(AND($C85<>0,$AN85=\"\"),1,0)","v":0},{"$f":"IF(AND($C85<>0,$AO85=\"\"),1,0)","v":0},null,{"$f":"IF(AND($D85<>0,$AP85=\"\"),1,IF(AND($E85<>0,$AQ85=\"\"),1,0))","v":0},{"$f":"IF(AND($D85<>0,$AR85=\"\"),1,IF(AND($E85<>0,$AS85=\"\"),1,0))","v":0},0,null,0,0]
["TRASTORNOS MENTALES Y DEL COMPORTAMIENTO DEBIDO A CONSUMO SUSTANCIAS PSICOTROPICAS","CONSUMO PERJUDICIAL DE ALCOHOL ",0,0,0,null,null,null,null,null,null,null,null,null,null,null,null,null,null,null,null,null,null,null,null,null,null,null,null,null,null,null,null,null,null,null,null,null,null,null,null,null,null,null,null,null,null,null,null,null,null,null,null,null,null,null,null,null,null,null,null,null,null,null,null,null,null,null,null,null,null,null,null,null,null,null,null,null,null,null,null,null,null,{"$f":"IF($AN86>$E86,\"* La celda 'Gestantes' debe ser menor o igual al Total de Mujeres en control. \",\"\")","v":""},"","","","","","",{"$f":"IF(AND($C86<>0,$AN86=\"\"),\"* No olvide escribir en la celda de 'Gestantes' (Digite CERO si no tiene). \",\"\")","v":""},"",null,"","","",null,"","",null,null,null,null,{"$f":"IF($AN86>$E86,1,0)","v":0},0,0,0,0,0,0,{"$f":"IF(AND($C86<>0,$AN86=\"\"),1,0)","v":0},{"$f":"IF(AND($C86<>0,$AO86=\"\"),1,0)","v":0},null,0,0,0,null,0,0]
[null,"CONSUMO DEPENDIENTE DEL ALCOHOL ",0,0,0,null,null,null,null,null,null,null,null,null,null,null,null,null,null,null,null,null,null,null,null,null,null,null,null,null,null,null,null,null,null,null,null,null,null,null,null,null,null,null,null,null,null,null,null,null,null,null,null,null,null,null,null,null,null,null,null,null,null,null,null,null,null,null,null,null,null,null,null,null,null,null,null,null,null,null,null,null,null,{"$f":"IF($AN87>$E87,\"* La celda 'Gestantes' debe ser menor o igual al Total de Mujeres en control. \",\"\")","v":""},"","","","","","",{"$f":"IF(AND($C87<>0,$AN87=\"\"),\"* No olvide escribir en la celda de 'Gestantes' (Digite CERO si no tiene). \",\"\")","v":""},"",null,"","","",null,"","",null,null,null,null,{"$f":"IF($AN87>$E87,1,0)","v":0},0,0,0,0,0,0,{"$f":"IF(AND($C87<>0,$AN87=\"\"),1,0)","v":0},{"$f":"IF(AND($C87<>0,$AO87=\"\"),1,0)","v":0},null,0,0,0,null,0,0]
[null,"CONSUMO PERJUDICIAL DE DROGAS",0,{"$f":"+F88+H88+J88+L88+N88+P88+R88+T88+V88+X88+Z88+AB88+AD88+AF88+AH88+AJ88+AL88","v":0},0]
[null,"CONSUMO DEPENDIENTE DE DROGAS ",0,0,0]
[null,"CONSUMO DE DROGAS Y ALCOHOL ",0,0,0,null,null,null,null,null,null,null,null,null,null,null,null,null,null,null,null,null,null,null,null,null,null,null,null,null,null,null,null,null,null,null,null,null,null,null,null,null,null,null,null,null,null,null,null,null,null,null,null,null,null,null,null,null,null,null,null,null,null,null,null,null,null,null,null,null,null,null,null,null,null,null,null,null,null,null,null,null,null,{"$f":"IF($AN90>$E90,\"* La celda 'Gestantes' debe ser menor o igual al Total de Mujeres en control. \",\"\")","v":""},"","","","","","",{"$f":"IF(AND($C90<>0,$AN90=\"\"),\"* No olvide escribir en la celda de 'Gestantes' (Digite CERO si no tiene). \",\"\")","v":""},"",null,"","","",null,"","",null,null,null,null,{"$f":"IF($AN90>$E90,1,0)","v":0},0,0,0,0,0,0,{"$f":"IF(AND($C90<>0,$AN90=\"\"),1,0)","v":0},{"$f":"IF(AND($C90<>0,$AO90=\"\"),1,0)","v":0},null,0,0,0,null,0,0]
["TRASTORNOS DEL COMPORTAMIENTO Y DE LAS EMOCIONES DE COMIENZO HABITUAL EN LA INFANCIA Y ADOLESCENCIA","TRASTORNO HIPERCINÉTICO",0,0,0,null,null,null,null,null,null,null,null,null,null,null,null,null,null,null,null,null,null,null,null,null,null,null,null,null,null,null,null,null,null,null,null,null,null,null,null,null,null,null,null,null,null,null,null,null,null,null,null,null,null,null,null,null,null,null,null,null,null,null,null,null,null,null,null,null,null,null,null,null,null,null,null,null,null,null,null,null,null,null,null,"","","","","",null,null,null,"","","",null,"","",null,null,null,null,null,null,0,0,0,0,0,null,null,null,0,0,0,null,0,0]
[null,"TRASTORNO DISOCIAL DESAFIANTE Y OPOSICIONISTA",0,0,0,null,null,null,null,null,null,null,null,null,null,null,null,null,null,null,null,null,null,null,null,null,null,null,null,null,null,null,null,null,null,null,null,null,null,null,null,null,null,null,null,null,null,null,null,null,null,null,null,null,null,null,null,null,null,null,null,null,null,null,null,null,null,null,null,null,null,null,null,null,null,null,null,null,null,null,null,null,null,null,null,"","","","","",null,null,null,"","","",null,"","",null,null,null,null,null,null,0,0,0,0,0,null,null,null,0,0,0,null,0,0]
[null,"TRASTORNO DE ANSIEDAD DE SEPARACIÓN EN LA INFANCIA",0,{"$f":"+F93+H93+J93","v":0},{"$f":"+G93+I93+K93","v":0},null,null,null,null,null,null,null,null,null,null,null,null,null,null,null,null,null,null,null,null,null,null,null,null,null,null,null,null,null,null,null,null,null,null,null,null,null,null,null,null,null,null,null,null,null,null,null,null,null,null,null,null,null,null,null,null,null,null,null,null,null,null,null,null,null,null,null,null,null,null,null,null,null,null,null,null,null,null,null,null,"","","","","",null,null,null,"","","",null,"","",null,null,null,null,null,null,0,0,0,0,0,null,null,null,0,0,0,null,0,0]
[null,"OTROS TRASTORNOS DEL COMPORTAMIENTO Y DE LAS EMOCIONES DE COMIENZO HABITUAL EN LA INFANCIA Y ADOLESCENCIA",{"$f":"SUM(D94:E94)","v":0},{"$f":"+F94+H94+J94+L94+N94","v":0},{"$f":"+G94+I94+K94+M94+O94","v":0},null,null,null,null,null,null,null,null,null,null,null,null,null,null,null,null,null,null,null,null,null,null,null,null,null,null,null,null,null,null,null,null,null,null,null,null,null,null,null,null,null,null,null,null,null,null,null,null,null,null,null,null,null,null,null,null,null,null,null,null,null,null,null,null,null,null,null,null,null,null,null,null,null,null,null,null,null,null,null,null,"","","","","",null,null,null,"","","",null,"","",null,null,null,null,null,null,0,0,0,0,0,null,null,null,0,0,0,null,0,0]
["TRASTORNOS DE ANSIEDAD","TRASTORNO DE ESTRÉS POST TRAUMATICO",0,{"$f":"SUM(F95+H95+J95+L95+N95+P95+R95+T95+V95+X95+Z95+AB95+AD95+AF95+AH95+AJ95+AL95)","v":0},0,null,null,null,null,null,null,null,null,null,null,null,null,null,null,null,null,null,null,null,null,null,null,null,null,null,null,null,null,null,null,null,null,null,null,null,null,null,null,null,null,null,null,null,null,null,null,null,null,null,null,null,null,null,null,null,null,null,null,null,null,null,null,null,null,null,null,null,null,null,null,null,null,null,null,null,null,null,null,{"$f":"IF($AN95>$E95,\"* La celda 'Gestantes' debe ser menor o igual al Total de Mujeres en control. \",\"\")","v":""},{"$f":"IF($AO95>$E95,\"* La celda 'Madres de Hijos menor de 5 años' debe ser menor o igual al Total de Mujeres en control. \",\"\")","v":""},"","","","","",{"$f":"IF(AND($C95<>0,$AN95=\"\"),\"* No olvide escribir en la celda de 'Gestantes' (Digite CERO si no tiene). \",\"\")","v":""},{"$f":"IF(AND($C95<>0,$AO95=\"\"),\"* No olvide escribir en la celda de 'Madres de Hijos menor de 5 años' (Digite CERO si no tiene). \",\"\")","v":""},null,"","","",null,"","",null,null,null,null,{"$f":"IF($AN95>$E95,1,0)","v":0},{"$f":"IF($AO95>$E95,1,0)","v":0},0,0,0,0,0,{"$f":"IF(AND($C95<>0,$AN95=\"\"),1,0)","v":0},{"$f":"IF(AND($C95<>0,$AO95=\"\"),1,0)","v":0},null,0,0,0,null,0,0]
[null,"TRASTORNO DE PÁNICO  ",0,0,0,null,null,null,null,null,null,null,null,null,null,null,null,null,null,null,null,null,null,null,null,null,null,null,null,null,null,null,null,null,null,null,null,null,null,null,null,null,null,null,null,null,null,null,null,null,null,null,null,null,null,null,null,null,null,null,null,null,null,null,null,null,null,null,null,null,null,null,null,null,null,null,null,null,null,null,null,null,null,"","","","","","","","","",null,"","","",null,"","",null,null,null,null,0,0,0,0,0,0,0,0,0,null,0,0,0,null,0,0]
[null,"FOBIAS SOCIALES",0,0,0,null,null,null,null,null,null,null,null,null,null,null,null,null,null,null,null,null,null,null,null,null,null,null,null,null,null,null,null,null,null,null,null,null,null,null,null,null,null,null,null,null,null,null,null,null,null,null,null,null,null,null,null,null,null,null,null,null,null,null,null,null,null,null,null,null,null,null,null,null,null,null,null,null,null,null,null,null,null,"","","","","","","","","",null,"","","",null,"","",null,null,null,null,0,0,0,0,0,0,0,0,0,null,0,0,0,null,0,0]
[null,"TRASTORNOS DE ANSIEDAD GENERALIZADA",0,0,0,null,null,null,null,null,null,null,null,null,null,null,null,null,null,null,null,null,null,null,null,null,null,null,null,null,null,null,null,null,null,null,null,null,null,null,null,null,null,null,null,null,null,null,null,null,null,null,null,null,null,null,null,null,null,null,null,null,null,null,null,null,null,null,null,null,null,null,null,null,null,null,null,null,null,null,null,null,null,"","","","","","","","","",null,"","","",null,"","",null,null,null,null,0,0,0,0,0,0,0,0,0,null,0,0,0,null,0,0]
[null,"OTROS TRASTORNOS DE ANSIEDAD",0,0,0,null,null,null,null,null,null,null,null,null,null,null,null,null,null,null,null,null,null,null,null,null,null,null,null,null,null,null,null,null,null,null,null,null,null,null,null,null,null,null,null,null,null,null,null,null,null,null,null,null,null,null,null,null,null,null,null,null,null,null,null,null,null,null,null,null,null,null,null,null,null,null,null,null,null,null,null,null,null,"","","","","","","","","",null,"","","",null,"","",null,null,null,null,0,0,0,0,0,0,0,0,0,null,0,0,0,null,0,0]
["DEMENCIAS (INCLUYE ALZHEIMER)","LEVE",{"$f":"SUM(D100:E100)","v":0},{"$f":"+F100+H100+J100+L100+N100+P100+R100+T100+V100+X100+Z100+AB100+AD100+AF100+AH100+AJ100+AL100","v":0},{"$f":"+G100+I100+K100+M100+O100+Q100+S100+U100+W100+Y100+AA100+AC100+AE100+AG100+AI100+AK100+AM100","v":0},null,null,null,null,null,null,null,null,null,null,null,null,null,null,null,null,null,null,null,null,null,null,null,null,null,null,null,null,null,null,null,null,null,null,null,null,null,null,null,null,null,null,null,null,null,null,null,null,null,null,null,null,null,null,null,null,null,null,null,null,null,null,null,null,null,null,null,null,null,null,null,null,null,null,null,null,null,null,"","","","","","","",null,null,null,null,null,null,null,null,null,null,null,null,null,0,0,0,0,0,0,0,null,null,null,0,0,0,null,0,0]
[null,"MODERADO",0,0,{"$f":"+G101+I101+K101+M101+O101+Q101+S101+U101+W101+Y101+AA101+AC101+AE101+AG101+AI101+AK101+AM101","v":0},null,null,null,null,null,null,null,null,null,null,null,null,null,null,null,null,null,null,null,null,null,null,null,null,null,null,null,null,null,null,null,null,null,null,null,null,null,null,null,null,null,null,null,null,null,null,null,null,null,null,null,null,null,null,null,null,null,null,null,null,null,null,null,null,null,null,null,null,null,null,null,null,null,null,null,null,null,null,"","","","","","","",null,null,null,null,null,null,null,"","",null,null,null,null,0,0,0,0,0,0,0,null,null,null,0,0,0,null,0,0]
[null,"AVANZADO",0,0,0,null,null,null,null,null,null,null,null,null,null,null,null,null,null,null,null,null,null,null,null,null,null,null,null,null,null,null,null,null,null,null,null,null,null,null,null,null,null,null,null,null,null,null,null,null,null,null,null,null,null,null,null,null,null,null,null,null,null,null,null,null,null,null,null,null,null,null,null,null,null,null,null,null,null,null,null,null,null,"","","","","","","",null,null,null,null,null,null,null,"","",null,null,null,null,0,0,0,0,0,0,0,null,null,null,0,0,0,null,0,0]
["ESQUIZOFRENIA",null,0,0,0,null,null,null,null,null,null,null,null,null,null,null,null,null,null,null,null,null,null,null,null,null,null,null,null,null,null,null,null,null,null,null,null,null,null,null,null,null,null,null,null,null,null,null,null,null,null,null,null,null,null,null,null,null,null,null,null,null,null,null,null,null,null,null,null,null,null,null,null,null,null,null,null,null,null,null,null,null,null,"","","","","","","","","",null,"","","",null,"","",null,null,null,null,0,0,0,0,0,0,0,0,0,null,0,0,0,null,0,0]
["PSICOSIS"]
["TRASTORNO ADAPTATIVO",null,0,0,0]
["PRIMER EPISODIO ESQUIZOFRENIA CON OCUPACION REGULAR",null,{"$f":"SUM(D106:E106)","v":0},0,0,null,null,null,null,null,null,null,null,null,null,null,null,null,null,null,null,null,null,null,null,null,null,null,null,null,null,null,null,null,null,null,null,null,null,null,null,null,null,null,null,null,null,null,null,null,null,null,null,null,null,null,null,null,null,null,null,null,null,null,null,null,null,null,null,null,null,null,null,null,null,null,null,null,null,null,null,null,null,"","","","","","","","","",null,"","","",null,"","",null,null,null,null,0,0,0,0,0,0,0,0,0,null,0,0,0,null,0,0]
["TRASTORNOS DE LA CONDUCTA ALIMENTARIA",null,0,0,0,null,null,null,null,null,null,null,null,null,null,null,null,null,null,null,null,null,null,null,null,null,null,null,null,null,null,null,null,null,null,null,null,null,null,null,null,null,null,null,null,null,null,null,null,null,null,null,null,null,null,null,null,null,null,null,null,null,null,null,null,null,null,null,null,null,null,null,null,null,null,null,null,null,null,null,null,null,null,"","","","","","","","","",null,"","","",null,"","",null,null,null,null,0,0,0,0,0,0,0,0,0,null,0,0,0,null,0,0]
["RETRASO MENTAL",null,0,0,0,null,null,null,null,null,null,null,null,null,null,null,null,null,null,null,null,null,null,null,null,null,null,null,null,null,null,null,null,null,null,null,null,null,null,null,null,null,null,null,null,null,null,null,null,null,null,null,null,null,null,null,null,null,null,null,null,null,null,null,null,null,null,null,null,null,null,null,null,null,null,null,null,null,null,null,null,null,null,"","","","","","","","","",null,"","","",null,"","",null,null,null,null,0,0,0,0,0,0,0,0,0,null,0,0,0,null,0,0]
["TRASTORNO DE PERSONALIDAD",null,0,0,0,null,null,null,null,null,null,null,null,null,null,null,null,null,null,null,null,null,null,null,null,null,null,null,null,null,null,null,null,null,null,null,null,null,null,null,null,null,null,null,null,null,null,null,null,null,null,null,null,null,null,null,null,null,null,null,null,null,null,null,null,null,null,null,null,null,null,null,null,null,null,null,null,null,null,null,null,null,null,"","","","","","","","","",null,"","","",null,"","",null,null,null,null,0,0,0,0,0,0,0,0,0,null,0,0,0,null,0,0]
["TRASTORNO GENERALIZADOS DEL DESARROLLO","AUTISMO",{"$f":"SUM(D110:E110)","v":0},{"$f":"+F110+H110+J110+L110+N110+P110+R110+T110+V110+X110+Z110+AB110+AD110+AF110+AH110+AJ110+AL110","v":0},{"$f":"+G110+I110+K110+M110+O110+Q110+S110+U110+W110+Y110+AA110+AC110+AE110+AG110+AI110+AK110+AM110","v":0}]
[null,"ASPERGER",0,0,0]
[null,"SÍNDROME DE RETT",0,0,0]
[null,"TRASTORNO DESINTEGRATIVO DE LA INFANCIA",0,0,0]
[null,"TRASTONO GENERALIZADO DEL DESARROLLO NO ESPECÍFICO",0,0,0,null,null,null,null,null,null,null,null,null,null,null,null,null,null,null,null,null,null,null,null,null,null,null,null,null,null,null,null,null,null,null,null,null,null,null,null,null,null,null,null,null,null,null,null,null,null,null,null,null,null,null,null,null,null,null,null,null,null,null,null,null,null,null,null,null,null,null,null,null,null,null,null,null,null,null,null,null,null,"","","","","","","","","",null,"","","",null,"","",null,null,null,null,0,0,0,0,0,0,0,0,0,null,0,0,0,null,0,0]
["EPILEPSIA",null,{"$f":"SUM(D115+E115)","v":0},{"$f":"SUM(F115+H115+J115+L115+N115+P115+R115+T115+V115+X115+Z115+AB115+AD115+AF115+AH115+AJ115+AL115)","v":0},{"$f":"SUM(G115+I115+K115+M115+O115+Q115+S115+U115+W115+Y115+AA115+AC115+AE115+AG115+AI115+AK115+AM115)","v":0},null,null,null,null,null,null,null,null,null,null,null,null,null,null,null,null,null,null,null,null,null,null,null,null,null,null,null,null,null,null,null,null,null,null,null,null,null,null,null,null,null,null,null,null,null,null,null,null,null,null,null,null,null,null,null,null,null,null,null,null,null,null,null,null,null,null,null,null,null,null,null,null,null,null,null,null,null,null,"","","","","","","","","",null,"","","",null,"","",null,null,null,null,0,0,0,0,0,0,0,0,0,null,0,0,0,null,0,0]
["OTRAS",null,0,{"$f":"+F116+H116+J116+L116+N116+P116+R116+T116+V116+X116+Z116+AB116+AD116+AF116+AH116+AJ116+AL116","v":0},{"$f":"+G116+I116+K116+M116+O116+Q116+S116+U116+W116+Y116+AA116+AC116+AE116+AG116+AI116+AK116+AM116","v":0},null,null,null,null,null,null,null,null,null,null,null,null,null,null,null,null,null,null,null,null,null,null,null,null,null,null,null,null,null,null,null,null,null,null,null,null,null,null,null,null,null,null,null,null,null,null,null,null,null,null,null,null,null,null,null,null,null,null,null,null,null,null,null,null,null,null,null,null,null,null,null,null,null,null,null,null,null,null,null,null,"","","","","",null,null,null,"","","",null,"","",null,null,null,null,null,null,0,0,0,0,0,null,null,null,0,0,0,null,0,0]
["SECCION B.2: PROGRAMA DE REHABILITACIÓN EN ESPECIALIDAD (PERSONAS CON TRANSTORNOS PSIQUIÁTRICO)"]
["TIPO","RUBRO","T O T A L",null,null,"GRUPO DE EDAD (en años)"]
[null,null,null,null,null,"0 a 4 años",null,"5 a 9 años",null,"10 a 14 años",null,"15 a 19 años",null,"20 a 24 años",null,"25 a 29 años",null,"30 a 34 años",null,"35 a 39 años",null,"40 a 44 años",null,"45 a 49 años",null,"50 a 54 años",null,"55 a 59 años",null,"60 a 64 años",null,"65 a 69 años",null,"70 a 74 años",null,"75 a 79 años",null,"80 y más años"]
[null,null,"Ambos\nsexos","Hombres","Mujeres","Hombres","Mujeres","Hombres","Mujeres","Hombres","Mujeres","Hombres","Mujeres","Hombres","Mujeres","Hombres","Mujeres","Hombres","Mujeres","Hombres","Mujeres","Hombres","Mujeres","Hombres","Mujeres","Hombres","Mujeres","Hombres","Mujeres","Hombres","Mujeres","Hombres","Mujeres","Hombres","Mujeres","Hombres","Mujeres","Hombres","Mujeres"]
["PROGRAMA DE REHABILITACIÓN TIPO I","NÚMERO DE PERSONAS EN CONTROL EN EL PROGRAMA",{"$f":"SUM(D121:E121)","v":0},{"$f":"+F121+H121+J121+L121+N121+P121+R121+T121+V121+X121+Z121+AB121+AD121+AF121+AH121+AJ121+AL121","v":0},{"$f":"+G121+I121+K121+M121+O121+Q121+S121+U121+W121+Y121+AA121+AC121+AE121+AG121+AI121+AK121+AM121","v":0}]
["PROGRAMA DE REHABILITACIÓN TIPO II","NÚMERO DE PERSONAS EN CONTROL EN EL PROGRAMA",{"$f":"SUM(D122:E122)","v":0},{"$f":"+F122+H122+J122+L122+N122+P122+R122+T122+V122+X122+Z122+AB122+AD122+AF122+AH122+AJ122+AL122","v":0},{"$f":"+G122+I122+K122+M122+O122+Q122+S122+U122+W122+Y122+AA122+AC122+AE122+AG122+AI122+AK122+AM122","v":0}]
[]
[]
[]
[]
[]
[]
[]
[]
[]
[]
[]
[]
[]
[]
[]
[]
[]
[]
[]
[{"$f":"SUM(A13:AU122)","v":0},"datos"]
[{"$f":"SUM(CX10:DO122)","v":0},"errores"]

{"sheet":"P7","index":7,"n_rows":57,"n_cols":12,"rows_kept":57,"cut":false,"hidden":false,"merged":[[23,0,23,2],[6,0,6,9],[29,1,29,2],[28,1,28,2],[27,1,27,2],[26,1,26,2],[24,0,24,2],[28,0,32,0],[30,1,30,2],[31,1,31,2],[32,1,32,2],[25,1,25,2],[25,0,27,0]]}
["DATOS DEL ESTABLECIMIENTO"]
[{"$f":"CONCATENATE(\"COMUNA: \",NOMBRE!$B$2,\" - \",\"( \",NOMBRE!$C$2,NOMBRE!$D$2,NOMBRE!$E$2,NOMBRE!$F$2,NOMBRE!$G$2,\" )\")","v":"COMUNA:  - (  )"}]
[{"$f":"CONCATENATE(\"ESTABLECIMIENTO/ESTRATEGIA: \",NOMBRE!$B$3,\" - \",\"( \",NOMBRE!$C$3,NOMBRE!$D$3,NOMBRE!$E$3,NOMBRE!$F$3,NOMBRE!$G$3,NOMBRE!$H$3,\" )\")","v":"ESTABLECIMIENTO/ESTRATEGIA:  - (  )"}]
[{"$f":"CONCATENATE(\"MES: \",NOMBRE!$B$6,\" - \",\"( \",NOMBRE!$C$6,NOMBRE!$D$6,\" )\")","v":"MES:  - (  )"}]
[{"$f":"CONCATENATE(\"AÑO: \",NOMBRE!$B$7)","v":"AÑO: 2023"}]
[]
["REM-P7. FAMILIAS EN CONTROL DE SALUD FAMILIAR"]
["SECCIÓN A. CLASIFICACIÓN DE LAS FAMILIAS SECTOR URBANO"]
["CLASIFICACIÓN DE LAS FAMILIAS POR SECTOR","TOTAL","SECTOR 1","SECTOR 2","SECTOR 3","SECTOR 4","SECTOR 5","SECTOR 6","SECTOR 7","SECTOR 8"]
["N° FAMILIAS INSCRITAS ",{"$f":"SUM(C10:J10)","v":0}]
["N° FAMILIAS EVALUADAS CON CARTOLA/ENCUESTA FAMILIAR",{"$f":"SUM(C11:J11)","v":0}]
["N° DE FAMILIAS EN RIESGO BAJO",{"$f":"SUM(C12:J12)","v":0}]
["N° DE FAMILIAS EN RIESGO MEDIO",{"$f":"SUM(C13:J13)","v":0}]
["N° DE FAMILIAS EN RIESGO ALTO",{"$f":"SUM(C14:J14)","v":0}]
[]
["SECCIÓN A.1 CLASIFICACIÓN DE LAS FAMILIAS SECTOR RURAL"]
["CLASIFICACIÓN DE LAS FAMILIAS POR SECTOR","TOTAL","SECTOR 1","SECTOR 2","SECTOR 3","SECTOR 4","SECTOR 5","SECTOR 6","SECTOR 7","SECTOR 8"]
["N° FAMILIAS INSCRITAS ",{"$f":"SUM(C18:J18)","v":0}]
["N° FAMILIAS EVALUADAS CON CARTOLA/ENCUESTA FAMILIAR",{"$f":"SUM(C19:J19)","v":0}]
["N° DE FAMILIAS EN RIESGO BAJO",{"$f":"SUM(C20:J20)","v":0}]
["N° DE FAMILIAS EN RIESGO MEDIO",{"$f":"SUM(C21:J21)","v":0}]
["N° DE FAMILIAS EN RIESGO ALTO",{"$f":"SUM(C22:J22)","v":0}]
["SECCIÓN B. INTERVENCIÓN EN FAMILIAS SECTOR URBANO Y RURAL"]
["INTERVENCIÓN EN FAMILIAS",null,null,"TOTAL","SECTOR 1","SECTOR 2","SECTOR 3","SECTOR 4","SECTOR 5","SECTOR 6","SECTOR 7","SECTOR 8"]
["N° FAMILIAS CON PLAN DE INTERVENCIÓN",null,null,{"$f":"SUM(E25:L25)","v":0}]
["N° FAMILIAS SIN PLAN DE INTERVENCIÓN","RIESGO BAJO",null,0]
[null,"RIESGO MEDIO",null,0]
[null,"RIESGO ALTO",null,0]
["N° FAMILIAS EGRESADAS DE PLANES DE INTERVENCIÓN","TOTAL DE EGRESOS",null,0]
[null,"ALTA POR CUMPLIR PLAN DE INTERVENCIÓN",null,0]
[null,"TRASLADO DE ESTABLECIMIENTO",null,0]
[null,"DERIVACIÓN POR COMPLEJIDAD DEL CASO",null,{"$f":"SUM(E32:L32)","v":0}]
[null,"POR ABANDONO",null,{"$f":"SUM(E33:L33)","v":0}]
[]
[]
[]
[]
[]
[]
[]
[]
[]
[]
[]
[]
[]
[]
[]
[]
[{"$f":"SUM(B10:J14,B18:J22,D25:L33)","v":0},"datos"]
[{"$f":"SUM(0)","v":0},"errores"]
[]
[]
[]
[]
[]
[{"$f":"SUM(A8:J30)","v":0}]

{"sheet":"P9","index":8,"n_rows":108,"n_cols":51,"rows_kept":108,"cut":false,"hidden":false,"merged":[[84,11,85,13],[6,2,6,16],[41,2,43,4],[52,2,54,4],[70,2,72,4],[70,14,72,16],[52,14,54,16],[41,14,43,16],[41,11,43,13],[9,14,9,16],[9,11,9,13],[9,8,9,10],[9,5,9,7],[41,8,43,10],[70,0,73,1],[70,5,72,7],[70,8,72,10],[70,11,72,13],[52,11,54,13],[56,0,56,1],[59,0,59,1],[52,5,54,7],[52,8,54,10],[65,0,65,1],[68,0,68,1],[64,0,64,1],[57,0,57,1],[66,0,66,1],[97,0,98,0],[99,0,100,0],[84,0,86,0],[84,1,86,1],[93,0,94,0],[95,0,96,0],[91,0,92,0],[87,0,88,0],[89,0,90,0],[49,0,49,1],[50,0,50,1],[45,0,45,1],[46,0,46,1],[47,0,47,1],[41,0,44,1],[41,5,43,7],[84,8,85,10],[84,2,85,4],[84,5,85,7],[52,0,55,1],[48,0,48,1],[78,0,78,1],[79,0,79,1],[80,0,80,1],[81,0,81,1],[74,0,74,1],[75,0,75,1],[76,0,76,1],[63,0,63,1],[77,0,77,1],[11,0,11,1],[9,0,10,1],[9,2,9,4],[20,0,26,0],[31,0,39,0],[12,0,19,0],[27,0,30,0]]}
["DATOS DEL ESTABLECIMIENTO"]
[{"$f":"CONCATENATE(\"COMUNA: \",NOMBRE!$B$2,\" - \",\"( \",NOMBRE!$C$2,NOMBRE!$D$2,NOMBRE!$E$2,NOMBRE!$F$2,NOMBRE!$G$2,\" )\")","v":"COMUNA:  - (  )"}]
[{"$f":"CONCATENATE(\"ESTABLECIMIENTO/ESTRATEGIA: \",NOMBRE!$B$3,\" - \",\"( \",NOMBRE!$C$3,NOMBRE!$D$3,NOMBRE!$E$3,NOMBRE!$F$3,NOMBRE!$G$3,NOMBRE!$H$3,\" )\")","v":"ESTABLECIMIENTO/ESTRATEGIA:  - (  )"}]
[{"$f":"CONCATENATE(\"MES: \",NOMBRE!$B$6,\" - \",\"( \",NOMBRE!$C$6,NOMBRE!$D$6,\" )\")","v":"MES:  - (  )"}]
[{"$f":"CONCATENATE(\"AÑO: \",NOMBRE!$B$7)","v":"AÑO: 2023"}]
[]
[null,null,"REM-P9. POBLACIÓN EN CONTROL DEL ADOLESCENTE",null,null,null,null,null,null,null,null,null,null,null,null,null,null,{"$f":"AK7 & AL7 & AM7 & AN7 & AK6 & AL6 & AM6 & AN6","v":""}]
[]
["SECCION A: POBLACIÓN EN CONTROL DE SALUD INTEGRAL DE ADOLESCENTES, SEGÚN ESTADO NUTRICIONAL"]
["INDICADOR NUTRICIONAL\nY\nPARÁMETROS DE MEDICIÓN",null,"TOTAL",null,null,"Adolescentes 10 a 14 años",null,null,"Adolescentes 15 a 19 años",null,null,"Adolescentes de Pueblos Originarios",null,null,"Adolescentes Migrantes"]
[null,null,"Ambos\nsexos","Hombres","Mujeres","Ambos\nsexos","Hombres","Mujeres","Ambos\nsexos","Hombres","Mujeres","Ambos\nsexos","Hombres","Mujeres","Ambos\nsexos","Hombres","Mujeres",{"$f":"AK11 & AL11 & AM11 & AN11","v":""},null,null,null,null,null,null,null,null,null,null,null,null,null,null,null,null,null,null,{"$f":"IF(F12=F40,\"\",\"* El Total de 'Adolescentes de 10 a 14 años' en control debe ser igual al Total del 'Diagnóstico Nutricional Integrado' (F40). \")","v":""},{"$f":"IF(I12=I40,\"\",\"* El Total de 'Adolescentes de 15 a 19 años' en control debe ser igual al Total del 'Diagnóstico Nutricional Integrado' (I40). \")","v":""},{"$f":"IF(L12=L40,\"\",\"* El Total de 'Adolescentes de Pueblos Originarios' en control debe ser igual al Total del 'Diagnóstico Nutricional Integrado' (L40). \")","v":""},{"$f":"IF(O12<=O40,\"\",\"* El Total de 'Adolescentes Migrantes' en control (O12) debe ser menor o igual al Total del 'Diagnóstico Nutricional Integrado' (040). \")","v":""},null,null,null,null,null,null,null,{"$f":"IF(F12=F40,0,1)","v":0},{"$f":"IF(I12=I40,0,1)","v":0},{"$f":"IF(L12=L40,0,1)","v":0},{"$f":"IF(O12=O40,0,1)","v":0}]
["TOTAL ADOLESCENTES EN CONTROL",null,{"$f":"SUM(D12:E12)","v":0},{"$f":"+G12+J12","v":0},{"$f":"+H12+K12","v":0},{"$f":"SUM(G12:H12)","v":0},null,null,{"$f":"SUM(J12:K12)","v":0},null,null,{"$f":"SUM(M12:N12)","v":0},null,null,{"$f":"SUM(P12:Q12)","v":0},null,null,{"$f":"AK12 & AL12 & AM12 & AN12","v":""},null,null,null,null,null,null,null,null,null,null,null,null,null,null,null,null,null,null,{"$f":"IF($C12<$L12, \"* El Total de 'Adolescentes de Pueblos Originarios' debe ser menor o igual al Total Adolecentes 'Ambos sexos'. \", \"\")","v":""},{"$f":"IF($C12<$O12, \"* El total de 'Adolescentes de Migrantes' debe ser menor o igual al Total Adolecentes 'Ambos sexos'. \", \"\")","v":""},{"$f":"IF(AND(D12<>0,M12=\"\"),\"* No olvide escribir en la celda de 'Pueblos Originarios' (Digite CERO si no tiene). \",IF(AND(E12<>0,N12=\"\"),\"* No olvide escribir en la celda de 'Pueblos Originarios' (Digite CERO si no tiene). \",\"\"))","v":""},{"$f":"IF(AND(D12<>0,P12=\"\"),\"* No olvide escribir en la celda de 'Población Migrantes' (Digite CERO si no tiene). \",IF(AND(E12<>0,Q12=\"\"),\"* No olvide escribir en la celda de 'Población Migrantes' (Digite CERO si no tiene). \",\"\"))","v":""},null,null,null,null,null,null,null,{"$f":"IF($C12<$L12, 1,0)","v":0},{"$f":"IF($C12<$O12, 1,0)","v":0},{"$f":"IF(AND(D12<>0,M12=\"\"),1,IF(AND(E12<>0,N12=\"\"),1,0))","v":0},{"$f":"IF(AND(D12<>0,P12=\"\"),1,IF(AND(E12<>0,Q12=\"\"),1,0))","v":0}]
["INDICADOR IMC / EDAD",">+ 3 D.E. (Obesidad Severa)",{"$f":"SUM(D13:E13)","v":0},{"$f":"+G13+J13","v":0},{"$f":"+H13+K13","v":0},{"$f":"SUM(G13:H13)","v":0},null,null,{"$f":"SUM(J13:K13)","v":0},null,null,{"$f":"SUM(M13:N13)","v":0},null,null,{"$f":"SUM(P13:Q13)","v":0},null,null,{"$f":"AK13 & AL13 & AM13 & AN13","v":""},null,null,null,null,null,null,null,null,null,null,null,null,null,null,null,null,null,null,{"$f":"IF($C13<$L13, \"* El Total de 'Adolescentes de Pueblos Originarios' debe ser menor o igual al Total Adolecentes 'Ambos sexos'. \", \"\")","v":""},{"$f":"IF($C13<$O13, \"* El total de 'Adolescentes de Migrantes' debe ser menor o igual al Total Adolecentes 'Ambos sexos'. \", \"\")","v":""},{"$f":"IF(AND(D13<>0,M13=\"\"),\"* No olvide escribir en la celda de 'Pueblos Originarios' (Digite CERO si no tiene). \",IF(AND(E13<>0,N13=\"\"),\"* No olvide escribir en la celda de 'Pueblos Originarios' (Digite CERO si no tiene). \",\"\"))","v":""},{"$f":"IF(AND(D13<>0,P13=\"\"),\"* No olvide escribir en la celda de 'Población Migrantes' (Digite CERO si no tiene). \",IF(AND(E13<>0,Q13=\"\"),\"* No olvide escribir en la celda de 'Población Migrantes' (Digite CERO si no tiene). \",\"\"))","v":""},null,null,null,null,null,null,null,{"$f":"IF($C13<$L13, 1,0)","v":0},{"$f":"IF($C13<$O13, 1,0)","v":0},{"$f":"IF(AND(D13<>0,M13=\"\"),1,IF(AND(E13<>0,N13=\"\"),1,0))","v":0},{"$f":"IF(AND(D13<>0,P13=\"\"),1,IF(AND(E13<>0,Q13=\"\"),1,0))","v":0}]
[null,"≥ +2.0 a+2,9 D.E. (Obesidad)",0,0,{"$f":"+H14+K14","v":0},{"$f":"SUM(G14:H14)","v":0},null,null,{"$f":"SUM(J14:K14)","v":0},null,null,{"$f":"SUM(M14:N14)","v":0},null,null,{"$f":"SUM(P14:Q14)","v":0},null,null,{"$f":"AK14 & AL14 & AM14 & AN14","v":""},null,null,null,null,null,null,null,null,null,null,null,null,null,null,null,null,null,null,{"$f":"IF($C14<$L14, \"* El Total de 'Adolescentes de Pueblos Originarios' debe ser menor o igual al Total Adolecentes 'Ambos sexos'. \", \"\")","v":""},{"$f":"IF($C14<$O14, \"* El total de 'Adolescentes de Migrantes' debe ser menor o igual al Total Adolecentes 'Ambos sexos'. \", \"\")","v":""},{"$f":"IF(AND(D14<>0,M14=\"\"),\"* No olvide escribir en la celda de 'Pueblos Originarios' (Digite CERO si no tiene). \",IF(AND(E14<>0,N14=\"\"),\"* No olvide escribir en la celda de 'Pueblos Originarios' (Digite CERO si no tiene). \",\"\"))","v":""},{"$f":"IF(AND(D14<>0,P14=\"\"),\"* No olvide escribir en la celda de 'Población Migrantes' (Digite CERO si no tiene). \",IF(AND(E14<>0,Q14=\"\"),\"* No olvide escribir en la celda de 'Población Migrantes' (Digite CERO si no tiene). \",\"\"))","v":""},null,null,null,null,null,null,null,0,0,{"$f":"IF(AND(D14<>0,M14=\"\"),1,IF(AND(E14<>0,N14=\"\"),1,0))","v":0},{"$f":"IF(AND(D14<>0,P14=\"\"),1,IF(AND(E14<>0,Q14=\"\"),1,0))","v":0}]
[null,"≥ +1.0 a+1,9 D.E.(Sobrepeso) ",0,0,0,{"$f":"SUM(G15:H15)","v":0},null,null,{"$f":"SUM(J15:K15)","v":0},null,null,{"$f":"SUM(M15:N15)","v":0},null,null,{"$f":"SUM(P15:Q15)","v":0},null,null,{"$f":"AK15 & AL15 & AM15 & AN15","v":""},null,null,null,null,null,null,null,null,null,null,null,null,null,null,null,null,null,null,{"$f":"IF($C15<$L15, \"* El Total de 'Adolescentes de Pueblos Originarios' debe ser menor o igual al Total Adolecentes 'Ambos sexos'. \", \"\")","v":""},{"$f":"IF($C15<$O15, \"* El total de 'Adolescentes de Migrantes' debe ser menor o igual al Total Adolecentes 'Ambos sexos'. \", \"\")","v":""},{"$f":"IF(AND(D15<>0,M15=\"\"),\"* No olvide escribir en la celda de 'Pueblos Originarios' (Digite CERO si no tiene). \",IF(AND(E15<>0,N15=\"\"),\"* No olvide escribir en la celda de 'Pueblos Originarios' (Digite CERO si no tiene). \",\"\"))","v":""},{"$f":"IF(AND(D15<>0,P15=\"\"),\"* No olvide escribir en la celda de 'Población Migrantes' (Digite CERO si no tiene). \",IF(AND(E15<>0,Q15=\"\"),\"* No olvide escribir en la celda de 'Población Migrantes' (Digite CERO si no tiene). \",\"\"))","v":""},null,null,null,null,null,null,null,0,0,{"$f":"IF(AND(D15<>0,M15=\"\"),1,IF(AND(E15<>0,N15=\"\"),1,0))","v":0},{"$f":"IF(AND(D15<>0,P15=\"\"),1,IF(AND(E15<>0,Q15=\"\"),1,0))","v":0}]
[null,"SUBTOTAL",0,{"$f":"+G16+J16","v":0},0,{"$f":"SUM(F13:F15)","v":0},{"$f":"SUM(G13:G15)","v":0},{"$f":"SUM(H13:H15)","v":0},{"$f":"SUM(I13:I15)","v":0},0,0,{"$f":"SUM(L13:L15)","v":0},0,0,0,0,0]
[null,"≤ -1.0 a-1,9 D.E.(Bajo peso)",0,0,0,{"$f":"SUM(G17:H17)","v":0},null,null,{"$f":"SUM(J17:K17)","v":0},null,null,{"$f":"SUM(M17:N17)","v":0},null,null,{"$f":"SUM(P17:Q17)","v":0},null,null,{"$f":"AK17 & AL17 & AM17 & AN17","v":""},null,null,null,null,null,null,null,null,null,null,null,null,null,null,null,null,null,null,{"$f":"IF($C17<$L17, \"* El Total de 'Adolescentes de Pueblos Originarios' debe ser menor o igual al Total Adolecentes 'Ambos sexos'. \", \"\")","v":""},{"$f":"IF($C17<$O17, \"* El total de 'Adolescentes de Migrantes' debe ser menor o igual al Total Adolecentes 'Ambos sexos'. \", \"\")","v":""},{"$f":"IF(AND(D17<>0,M17=\"\"),\"* No olvide escribir en la celda de 'Pueblos Originarios' (Digite CERO si no tiene). \",IF(AND(E17<>0,N17=\"\"),\"* No olvide escribir en la celda de 'Pueblos Originarios' (Digite CERO si no tiene). \",\"\"))","v":""},{"$f":"IF(AND(D17<>0,P17=\"\"),\"* No olvide escribir en la celda de 'Población Migrantes' (Digite CERO si no tiene). \",IF(AND(E17<>0,Q17=\"\"),\"* No olvide escribir en la celda de 'Población Migrantes' (Digite CERO si no tiene). \",\"\"))","v":""},null,null,null,null,null,null,null,0,0,{"$f":"IF(AND(D17<>0,M17=\"\"),1,IF(AND(E17<>0,N17=\"\"),1,0))","v":0},{"$f":"IF(AND(D17<>0,P17=\"\"),1,IF(AND(E17<>0,Q17=\"\"),1,0))","v":0}]
[null,"≤ -2.0 D.E. (Desnutrición)",0,0,0,{"$f":"SUM(G18:H18)","v":0},null,null,{"$f":"SUM(J18:K18)","v":0},null,null,{"$f":"SUM(M18:N18)","v":0},null,null,{"$f":"SUM(P18:Q18)","v":0},null,null,{"$f":"AK18 & AL18 & AM18 & AN18","v":""},null,null,null,null,null,null,null,null,null,null,null,null,null,null,null,null,null,null,{"$f":"IF($C18<$L18, \"* El Total de 'Adolescentes de Pueblos Originarios' debe ser menor o igual al Total Adolecentes 'Ambos sexos'. \", \"\")","v":""},{"$f":"IF($C18<$O18, \"* El total de 'Adolescentes de Migrantes' debe ser menor o igual al Total Adolecentes 'Ambos sexos'. \", \"\")","v":""},{"$f":"IF(AND(D18<>0,M18=\"\"),\"* No olvide escribir en la celda de 'Pueblos Originarios' (Digite CERO si no tiene). \",IF(AND(E18<>0,N18=\"\"),\"* No olvide escribir en la celda de 'Pueblos Originarios' (Digite CERO si no tiene). \",\"\"))","v":""},{"$f":"IF(AND(D18<>0,P18=\"\"),\"* No olvide escribir en la celda de 'Población Migrantes' (Digite CERO si no tiene). \",IF(AND(E18<>0,Q18=\"\"),\"* No olvide escribir en la celda de 'Población Migrantes' (Digite CERO si no tiene). \",\"\"))","v":""},null,null,null,null,null,null,null,0,0,{"$f":"IF(AND(D18<>0,M18=\"\"),1,IF(AND(E18<>0,N18=\"\"),1,0))","v":0},{"$f":"IF(AND(D18<>0,P18=\"\"),1,IF(AND(E18<>0,Q18=\"\"),1,0))","v":0}]
[null,"SUBTOTAL",0,0,0,{"$f":"SUM(F17:F18)","v":0},{"$f":"SUM(G17:G18)","v":0},{"$f":"SUM(H17:H18)","v":0},0,0,0,{"$f":"SUM(L17:L18)","v":0},0,0,0,0,0]
[null," -0.9 a+ 0.9 D.E. (Peso Normal)",0,{"$f":"+G20+J20","v":0},0,{"$f":"SUM(G20:H20)","v":0},null,null,{"$f":"SUM(J20:K20)","v":0},null,null,{"$f":"SUM(M20:N20)","v":0},null,null,{"$f":"SUM(P20:Q20)","v":0},null,null,{"$f":"AK20 & AL20 & AM20 & AN20","v":""},null,null,null,null,null,null,null,null,null,null,null,null,null,null,null,null,null,null,{"$f":"IF($C20<$L20, \"* El Total de 'Adolescentes de Pueblos Originarios' debe ser menor o igual al Total Adolecentes 'Ambos sexos'. \", \"\")","v":""},{"$f":"IF($C20<$O20, \"* El total de 'Adolescentes de Migrantes' debe ser menor o igual al Total Adolecentes 'Ambos sexos'. \", \"\")","v":""},{"$f":"IF(AND(D20<>0,M20=\"\"),\"* No olvide escribir en la celda de 'Pueblos Originarios' (Digite CERO si no tiene). \",IF(AND(E20<>0,N20=\"\"),\"* No olvide escribir en la celda de 'Pueblos Originarios' (Digite CERO si no tiene). \",\"\"))","v":""},{"$f":"IF(AND(D20<>0,P20=\"\"),\"* No olvide escribir en la celda de 'Población Migrantes' (Digite CERO si no tiene). \",IF(AND(E20<>0,Q20=\"\"),\"* No olvide escribir en la celda de 'Población Migrantes' (Digite CERO si no tiene). \",\"\"))","v":""},null,null,null,null,null,null,null,0,0,{"$f":"IF(AND(D20<>0,M20=\"\"),1,IF(AND(E20<>0,N20=\"\"),1,0))","v":0},{"$f":"IF(AND(D20<>0,P20=\"\"),1,IF(AND(E20<>0,Q20=\"\"),1,0))","v":0}]
["INDICADOR TALLA/EDAD","≥+ 2.0 D.E.(Talla Alta)",0,{"$f":"+G21+J21","v":0},0,{"$f":"SUM(G21:H21)","v":0},null,null,{"$f":"SUM(J21:K21)","v":0},null,null,{"$f":"SUM(M21:N21)","v":0},null,null,{"$f":"SUM(P21:Q21)","v":0},null,null,{"$f":"AK21 & AL21 & AM21 & AN21","v":""},null,null,null,null,null,null,null,null,null,null,null,null,null,null,null,null,null,null,{"$f":"IF($C21<$L21, \"* El Total de 'Adolescentes de Pueblos Originarios' debe ser menor o igual al Total Adolecentes 'Ambos sexos'. \", \"\")","v":""},{"$f":"IF($C21<$O21, \"* El total de 'Adolescentes de Migrantes' debe ser menor o igual al Total Adolecentes 'Ambos sexos'. \", \"\")","v":""},{"$f":"IF(AND(D21<>0,M21=\"\"),\"* No olvide escribir en la celda de 'Pueblos Originarios' (Digite CERO si no tiene). \",IF(AND(E21<>0,N21=\"\"),\"* No olvide escribir en la celda de 'Pueblos Originarios' (Digite CERO si no tiene). \",\"\"))","v":""},{"$f":"IF(AND(D21<>0,P21=\"\"),\"* No olvide escribir en la celda de 'Población Migrantes' (Digite CERO si no tiene). \",IF(AND(E21<>0,Q21=\"\"),\"* No olvide escribir en la celda de 'Población Migrantes' (Digite CERO si no tiene). \",\"\"))","v":""},null,null,null,null,null,null,null,0,0,{"$f":"IF(AND(D21<>0,M21=\"\"),1,IF(AND(E21<>0,N21=\"\"),1,0))","v":0},{"$f":"IF(AND(D21<>0,P21=\"\"),1,IF(AND(E21<>0,Q21=\"\"),1,0))","v":0}]
[null,"+ 1.0 a+ 1.9 D.E. (Talla Normal Alta)",0,0,0,{"$f":"SUM(G22:H22)","v":0},null,null,{"$f":"SUM(J22:K22)","v":0},null,null,{"$f":"SUM(M22:N22)","v":0},null,null,{"$f":"SUM(P22:Q22)","v":0},null,null,{"$f":"AK22 & AL22 & AM22 & AN22","v":""},null,null,null,null,null,null,null,null,null,null,null,null,null,null,null,null,null,null,{"$f":"IF($C22<$L22, \"* El Total de 'Adolescentes de Pueblos Originarios' debe ser menor o igual al Total Adolecentes 'Ambos sexos'. \", \"\")","v":""},{"$f":"IF($C22<$O22, \"* El total de 'Adolescentes de Migrantes' debe ser menor o igual al Total Adolecentes 'Ambos sexos'. \", \"\")","v":""},{"$f":"IF(AND(D22<>0,M22=\"\"),\"* No olvide escribir en la celda de 'Pueblos Originarios' (Digite CERO si no tiene). \",IF(AND(E22<>0,N22=\"\"),\"* No olvide escribir en la celda de 'Pueblos Originarios' (Digite CERO si no tiene). \",\"\"))","v":""},{"$f":"IF(AND(D22<>0,P22=\"\"),\"* No olvide escribir en la celda de 'Población Migrantes' (Digite CERO si no tiene). \",IF(AND(E22<>0,Q22=\"\"),\"* No olvide escribir en la celda de 'Población Migrantes' (Digite CERO si no tiene). \",\"\"))","v":""},null,null,null,null,null,null,null,0,0,{"$f":"IF(AND(D22<>0,M22=\"\"),1,IF(AND(E22<>0,N22=\"\"),1,0))","v":0},{"$f":"IF(AND(D22<>0,P22=\"\"),1,IF(AND(E22<>0,Q22=\"\"),1,0))","v":0}]
[null,"SUBTOTAL",0,0,0,{"$f":"SUM(F21:F22)","v":0},{"$f":"SUM(G21:G22)","v":0},{"$f":"SUM(H21:H22)","v":0},{"$f":"SUM(I21:I22)","v":0},0,0,{"$f":"SUM(L21:L22)","v":0},0,0,{"$f":"SUM(O21:O22)","v":0},0,0]
[null,"- 1.0 a -1.9 D.E. (Talla Normal Baja)",0,0,0,{"$f":"SUM(G24:H24)","v":0},null,null,{"$f":"SUM(J24:K24)","v":0},null,null,{"$f":"SUM(M24:N24)","v":0},null,null,{"$f":"SUM(P24:Q24)","v":0},null,null,{"$f":"AK24 & AL24 & AM24 & AN24","v":""},null,null,null,null,null,null,null,null,null,null,null,null,null,null,null,null,null,null,{"$f":"IF($C24<$L24, \"* El Total de 'Adolescentes de Pueblos Originarios' debe ser menor o igual al Total Adolecentes 'Ambos sexos'. \", \"\")","v":""},{"$f":"IF($C24<$O24, \"* El total de 'Adolescentes de Migrantes' debe ser menor o igual al Total Adolecentes 'Ambos sexos'. \", \"\")","v":""},{"$f":"IF(AND(D24<>0,M24=\"\"),\"* No olvide escribir en la celda de 'Pueblos Originarios' (Digite CERO si no tiene). \",IF(AND(E24<>0,N24=\"\"),\"* No olvide escribir en la celda de 'Pueblos Originarios' (Digite CERO si no tiene). \",\"\"))","v":""},{"$f":"IF(AND(D24<>0,P24=\"\"),\"* No olvide escribir en la celda de 'Población Migrantes' (Digite CERO si no tiene). \",IF(AND(E24<>0,Q24=\"\"),\"* No olvide escribir en la celda de 'Población Migrantes' (Digite CERO si no tiene). \",\"\"))","v":""},null,null,null,null,null,null,null,0,0,{"$f":"IF(AND(D24<>0,M24=\"\"),1,IF(AND(E24<>0,N24=\"\"),1,0))","v":0},{"$f":"IF(AND(D24<>0,P24=\"\"),1,IF(AND(E24<>0,Q24=\"\"),1,0))","v":0}]
[null,"< 2 D.E. (Talla Baja)",0,0,0,{"$f":"SUM(G25:H25)","v":0},null,null,{"$f":"SUM(J25:K25)","v":0},null,null,{"$f":"SUM(M25:N25)","v":0},null,null,{"$f":"SUM(P25:Q25)","v":0},null,null,{"$f":"AK25 & AL25 & AM25 & AN25","v":""},null,null,null,null,null,null,null,null,null,null,null,null,null,null,null,null,null,null,{"$f":"IF($C25<$L25, \"* El Total de 'Adolescentes de Pueblos Originarios' debe ser menor o igual al Total Adolecentes 'Ambos sexos'. \", \"\")","v":""},{"$f":"IF($C25<$O25, \"* El total de 'Adolescentes de Migrantes' debe ser menor o igual al Total Adolecentes 'Ambos sexos'. \", \"\")","v":""},{"$f":"IF(AND(D25<>0,M25=\"\"),\"* No olvide escribir en la celda de 'Pueblos Originarios' (Digite CERO si no tiene). \",IF(AND(E25<>0,N25=\"\"),\"* No olvide escribir en la celda de 'Pueblos Originarios' (Digite CERO si no tiene). \",\"\"))","v":""},{"$f":"IF(AND(D25<>0,P25=\"\"),\"* No olvide escribir en la celda de 'Población Migrantes' (Digite CERO si no tiene). \",IF(AND(E25<>0,Q25=\"\"),\"* No olvide escribir en la celda de 'Población Migrantes' (Digite CERO si no tiene). \",\"\"))","v":""},null,null,null,null,null,null,null,0,0,{"$f":"IF(AND(D25<>0,M25=\"\"),1,IF(AND(E25<>0,N25=\"\"),1,0))","v":0},{"$f":"IF(AND(D25<>0,P25=\"\"),1,IF(AND(E25<>0,Q25=\"\"),1,0))","v":0}]
[null,"SUBTOTAL",0,0,0,{"$f":"SUM(F24:F25)","v":0},{"$f":"SUM(G24:G25)","v":0},0,{"$f":"SUM(I24:I25)","v":0},0,0,0,0,0,{"$f":"SUM(O24:O25)","v":0},0,0]
[null,"-0.9 a+ 0.9 D.E. (Talla Normal)",0,0,{"$f":"+H27+K27","v":0},{"$f":"SUM(G27:H27)","v":0},null,null,{"$f":"SUM(J27:K27)","v":0},null,null,{"$f":"SUM(M27:N27)","v":0},null,null,{"$f":"SUM(P27:Q27)","v":0},null,null,{"$f":"AK27 & AL27 & AM27 & AN27","v":""},null,null,null,null,null,null,null,null,null,null,null,null,null,null,null,null,null,null,{"$f":"IF($C27<$L27, \"* El Total de 'Adolescentes de Pueblos Originarios' debe ser menor o igual al Total Adolecentes 'Ambos sexos'. \", \"\")","v":""},{"$f":"IF($C27<$O27, \"* El total de 'Adolescentes de Migrantes' debe ser menor o igual al Total Adolecentes 'Ambos sexos'. \", \"\")","v":""},{"$f":"IF(AND(D27<>0,M27=\"\"),\"* No olvide escribir en la celda de 'Pueblos Originarios' (Digite CERO si no tiene). \",IF(AND(E27<>0,N27=\"\"),\"* No olvide escribir en la celda de 'Pueblos Originarios' (Digite CERO si no tiene). \",\"\"))","v":""},{"$f":"IF(AND(D27<>0,P27=\"\"),\"* No olvide escribir en la celda de 'Población Migrantes' (Digite CERO si no tiene). \",IF(AND(E27<>0,Q27=\"\"),\"* No olvide escribir en la celda de 'Población Migrantes' (Digite CERO si no tiene). \",\"\"))","v":""},null,null,null,null,null,null,null,0,0,{"$f":"IF(AND(D27<>0,M27=\"\"),1,IF(AND(E27<>0,N27=\"\"),1,0))","v":0},{"$f":"IF(AND(D27<>0,P27=\"\"),1,IF(AND(E27<>0,Q27=\"\"),1,0))","v":0}]
["RANGOS PERCENTILARES PARA CIRCUNFERENCIA DE CINTURA","NORMAL (p<75)",0,0,0,{"$f":"SUM(G28:H28)","v":0},null,null,{"$f":"SUM(J28:K28)","v":0},null,null,{"$f":"SUM(M28:N28)","v":0},null,null,{"$f":"SUM(P28:Q28)","v":0},null,null,{"$f":"AK28 & AL28 & AM28 & AN28","v":""},null,null,null,null,null,null,null,null,null,null,null,null,null,null,null,null,null,null,{"$f":"IF($C28<$L28, \"* El Total de 'Adolescentes de Pueblos Originarios' debe ser menor o igual al Total Adolecentes 'Ambos sexos'. \", \"\")","v":""},{"$f":"IF($C28<$O28, \"* El total de 'Adolescentes de Migrantes' debe ser menor o igual al Total Adolecentes 'Ambos sexos'. \", \"\")","v":""},{"$f":"IF(AND(D28<>0,M28=\"\"),\"* No olvide escribir en la celda de 'Pueblos Originarios' (Digite CERO si no tiene). \",IF(AND(E28<>0,N28=\"\"),\"* No olvide escribir en la celda de 'Pueblos Originarios' (Digite CERO si no tiene). \",\"\"))","v":""},{"$f":"IF(AND(D28<>0,P28=\"\"),\"* No olvide escribir en la celda de 'Población Migrantes' (Digite CERO si no tiene). \",IF(AND(E28<>0,Q28=\"\"),\"* No olvide escribir en la celda de 'Población Migrantes' (Digite CERO si no tiene). \",\"\"))","v":""},null,null,null,null,null,null,null,0,0,{"$f":"IF(AND(D28<>0,M28=\"\"),1,IF(AND(E28<>0,N28=\"\"),1,0))","v":0},{"$f":"IF(AND(D28<>0,P28=\"\"),1,IF(AND(E28<>0,Q28=\"\"),1,0))","v":0}]
[null,"RIESGO DE OBESIDAD (p75<p<90)",0,0,0,{"$f":"SUM(G29:H29)","v":0},null,null,{"$f":"SUM(J29:K29)","v":0},null,null,{"$f":"SUM(M29:N29)","v":0},null,null,{"$f":"SUM(P29:Q29)","v":0},null,null,{"$f":"AK29 & AL29 & AM29 & AN29","v":""},null,null,null,null,null,null,null,null,null,null,null,null,null,null,null,null,null,null,{"$f":"IF($C29<$L29, \"* El Total de 'Adolescentes de Pueblos Originarios' debe ser menor o igual al Total Adolecentes 'Ambos sexos'. \", \"\")","v":""},{"$f":"IF($C29<$O29, \"* El total de 'Adolescentes de Migrantes' debe ser menor o igual al Total Adolecentes 'Ambos sexos'. \", \"\")","v":""},{"$f":"IF(AND(D29<>0,M29=\"\"),\"* No olvide escribir en la celda de 'Pueblos Originarios' (Digite CERO si no tiene). \",IF(AND(E29<>0,N29=\"\"),\"* No olvide escribir en la celda de 'Pueblos Originarios' (Digite CERO si no tiene). \",\"\"))","v":""},{"$f":"IF(AND(D29<>0,P29=\"\"),\"* No olvide escribir en la celda de 'Población Migrantes' (Digite CERO si no tiene). \",IF(AND(E29<>0,Q29=\"\"),\"* No olvide escribir en la celda de 'Población Migrantes' (Digite CERO si no tiene). \",\"\"))","v":""},null,null,null,null,null,null,null,0,0,{"$f":"IF(AND(D29<>0,M29=\"\"),1,IF(AND(E29<>0,N29=\"\"),1,0))","v":0},{"$f":"IF(AND(D29<>0,P29=\"\"),1,IF(AND(E29<>0,Q29=\"\"),1,0))","v":0}]
[null,"OBESIDAD ABDOMINAL p>90)",0,0,0,{"$f":"SUM(G30:H30)","v":0},null,null,{"$f":"SUM(J30:K30)","v":0},null,null,{"$f":"SUM(M30:N30)","v":0},null,null,{"$f":"SUM(P30:Q30)","v":0},null,null,{"$f":"AK30 & AL30 & AM30 & AN30","v":""},null,null,null,null,null,null,null,null,null,null,null,null,null,null,null,null,null,null,{"$f":"IF($C30<$L30, \"* El Total de 'Adolescentes de Pueblos Originarios' debe ser menor o igual al Total Adolecentes 'Ambos sexos'. \", \"\")","v":""},{"$f":"IF($C30<$O30, \"* El total de 'Adolescentes de Migrantes' debe ser menor o igual al Total Adolecentes 'Ambos sexos'. \", \"\")","v":""},{"$f":"IF(AND(D30<>0,M30=\"\"),\"* No olvide escribir en la celda de 'Pueblos Originarios' (Digite CERO si no tiene). \",IF(AND(E30<>0,N30=\"\"),\"* No olvide escribir en la celda de 'Pueblos Originarios' (Digite CERO si no tiene). \",\"\"))","v":""},{"$f":"IF(AND(D30<>0,P30=\"\"),\"* No olvide escribir en la celda de 'Población Migrantes' (Digite CERO si no tiene). \",IF(AND(E30<>0,Q30=\"\"),\"* No olvide escribir en la celda de 'Población Migrantes' (Digite CERO si no tiene). \",\"\"))","v":""},null,null,null,null,null,null,null,0,0,{"$f":"IF(AND(D30<>0,M30=\"\"),1,IF(AND(E30<>0,N30=\"\"),1,0))","v":0},{"$f":"IF(AND(D30<>0,P30=\"\"),1,IF(AND(E30<>0,Q30=\"\"),1,0))","v":0}]
[null,"TOTAL",0,0,0,{"$f":"SUM(F28:F30)","v":0},{"$f":"SUM(G28:G30)","v":0},0,{"$f":"SUM(I28:I30)","v":0},0,0,{"$f":"SUM(L28:L30)","v":0},0,0,{"$f":"SUM(O28:O30)","v":0},0,0]
["DIAGNOSTICO NUTRICIONAL INTEGRADO","DEFICIT PONDERALO BAJO PESO",0,{"$f":"+G32+J32","v":0},{"$f":"+H32+K32","v":0},{"$f":"SUM(G32:H32)","v":0},null,null,{"$f":"SUM(J32:K32)","v":0},null,null,{"$f":"SUM(M32:N32)","v":0},null,null,{"$f":"SUM(P32:Q32)","v":0},null,null,{"$f":"AK32 & AL32 & AM32 & AN32","v":""},null,null,null,null,null,null,null,null,null,null,null,null,null,null,null,null,null,null,{"$f":"IF($C32<$L32, \"* El Total de 'Adolescentes de Pueblos Originarios' debe ser menor o igual al Total Adolecentes 'Ambos sexos'. \", \"\")","v":""},{"$f":"IF($C32<$O32, \"* El total de 'Adolescentes de Migrantes' debe ser menor o igual al Total Adolecentes 'Ambos sexos'. \", \"\")","v":""},{"$f":"IF(AND(D32<>0,M32=\"\"),\"* No olvide escribir en la celda de 'Pueblos Originarios' (Digite CERO si no tiene). \",IF(AND(E32<>0,N32=\"\"),\"* No olvide escribir en la celda de 'Pueblos Originarios' (Digite CERO si no tiene). \",\"\"))","v":""},{"$f":"IF(AND(D32<>0,P32=\"\"),\"* No olvide escribir en la celda de 'Población Migrantes' (Digite CERO si no tiene). \",IF(AND(E32<>0,Q32=\"\"),\"* No olvide escribir en la celda de 'Población Migrantes' (Digite CERO si no tiene). \",\"\"))","v":""},null,null,null,null,null,null,null,0,0,{"$f":"IF(AND(D32<>0,M32=\"\"),1,IF(AND(E32<>0,N32=\"\"),1,0))","v":0},{"$f":"IF(AND(D32<>0,P32=\"\"),1,IF(AND(E32<>0,Q32=\"\"),1,0))","v":0}]
[null,"DESNUTRIDO",0,0,0,0,null,null,0,null,null,0,null,null,0,null,null,"",null,null,null,null,null,null,null,null,null,null,null,null,null,null,null,null,null,null,"","","","",null,null,null,null,null,null,null,0,0,0,0]
[null,"SOBREPESO / RIESGO OBESIDAD",0,0,0,0,null,null,0,null,null,0,null,null,0,null,null,"",null,null,null,null,null,null,null,null,null,null,null,null,null,null,null,null,null,null,"","","","",null,null,null,null,null,null,null,0,0,0,0]
[null,"OBESO",0,0,0,0,null,null,0,null,null,0,null,null,0,null,null,"",null,null,null,null,null,null,null,null,null,null,null,null,null,null,null,null,null,null,"","","","",null,null,null,null,null,null,null,0,0,0,0]
[null,"OBESO SEVERO",0,0,0,0,null,null,0,null,null,0,null,null,0,null,null,"",null,null,null,null,null,null,null,null,null,null,null,null,null,null,null,null,null,null,"","","","",null,null,null,null,null,null,null,0,0,0,0]
[null,"NORMAL O EUTROFIA",0,{"$f":"+G37+J37","v":0},0,0,null,null,0,null,null,0,null,null,0,null,null,"",null,null,null,null,null,null,null,null,null,null,null,null,null,null,null,null,null,null,"","","","",null,null,null,null,null,null,null,0,0,0,0]
[null,"SUBTOTAL",0,{"$f":"+G38+J38","v":0},0,{"$f":"SUM(F32:F37)","v":0},{"$f":"SUM(G32:G37)","v":0},0,{"$f":"SUM(I32:I37)","v":0},{"$f":"SUM(J32:J37)","v":0},0,0,{"$f":"SUM(M32:M37)","v":0},{"$f":"SUM(N32:N37)","v":0},{"$f":"SUM(O32:O37)","v":0},0,0]
[null,"DESNUTRICIÓN \nSECUNDARIA",0,{"$f":"+G39+J39","v":0},0,{"$f":"SUM(G39:H39)","v":0},null,null,{"$f":"SUM(J39:K39)","v":0},null,null,{"$f":"SUM(M39:N39)","v":0},null,null,{"$f":"SUM(P39:Q39)","v":0},null,null,{"$f":"AK39 & AL39 & AM39 & AN39","v":""},null,null,null,null,null,null,null,null,null,null,null,null,null,null,null,null,null,null,{"$f":"IF($C39<$L39, \"* El Total de 'Adolescentes de Pueblos Originarios' debe ser menor o igual al Total Adolecentes 'Ambos sexos'. \", \"\")","v":""},{"$f":"IF($C39<$O39, \"* El total de 'Adolescentes de Migrantes' debe ser menor o igual al Total Adolecentes 'Ambos sexos'. \", \"\")","v":""},{"$f":"IF(AND(D39<>0,M39=\"\"),\"* No olvide escribir en la celda de 'Pueblos Originarios' (Digite CERO si no tiene). \",IF(AND(E39<>0,N39=\"\"),\"* No olvide escribir en la celda de 'Pueblos Originarios' (Digite CERO si no tiene). \",\"\"))","v":""},{"$f":"IF(AND(D39<>0,P39=\"\"),\"* No olvide escribir en la celda de 'Población Migrantes' (Digite CERO si no tiene). \",IF(AND(E39<>0,Q39=\"\"),\"* No olvide escribir en la celda de 'Población Migrantes' (Digite CERO si no tiene). \",\"\"))","v":""},null,null,null,null,null,null,null,0,0,{"$f":"IF(AND(D39<>0,M39=\"\"),1,IF(AND(E39<>0,N39=\"\"),1,0))","v":0},{"$f":"IF(AND(D39<>0,P39=\"\"),1,IF(AND(E39<>0,Q39=\"\"),1,0))","v":0}]
[null,"T O T A L",{"$f":"SUM(C32:C37)+C39","v":0},0,0,0,{"$f":"SUM(G32:G37)+G39","v":0},0,0,{"$f":"SUM(J32:J37)+J39","v":0},0,0,0,0,0,0,0]
["SECCION B: POBLACIÓN EN CONTROL SALUD INTEGRAL DE ADOLESCENTES, SEGÚN EDUCACIÓN Y TRABAJO"]
["Estudio/trabajo",null,"TOTAL",null,null,"Adolescentes 10-14 años",null,null,"Adolescentes 15 - 19 años",null,null,"Adolescentes de Pueblos Originarios",null,null,"Adolescentes Migrantes"]
[]
[]
[null,null,"Ambos sexos","Hombre","Mujer","Ambos sexos","Hombre","Mujer","Ambos sexos","Hombre","Mujer","Ambos sexos","Hombre","Mujer","Ambos sexos","Hombre","Mujer"]
["ESTUDIA",null,{"$f":"SUM(D46:E46)","v":0},{"$f":"+G46+J46","v":0},{"$f":"+H46+K46","v":0},{"$f":"SUM(G46:H46)","v":0},null,null,{"$f":"SUM(J46:K46)","v":0},null,null,{"$f":"SUM(M46:N46)","v":0},null,null,{"$f":"SUM(P46:Q46)","v":0},null,null,{"$f":"AJ46 & \" \" & AK46 & AL46 & AM46 & AN46","v":" "},null,null,null,null,null,null,null,null,null,null,null,null,null,null,null,null,null,{"$f":"IF($C$12<$C46, \"* El total de Adolescentes según educacion y trabajono puede ser mayor al total de Adolescentes en control. \", \"\")","v":""},{"$f":"IF($C46<$L46, \"* El total de Adolescentes de Pueblos Originarios no puede ser mayor al total de Adolescentes. \", \"\")","v":""},{"$f":"IF($C46<$O46, \"* El total de Adolescentes de Migrantes no puede ser mayor al total de Adolescentes. \", \"\")","v":""},{"$f":"IF(AND(D46<>0,M46=\"\"),\"* No olvide escribir en la celda de Pueblos Originarios (Digite CERO si no tiene). \",IF(AND(E46<>0,N46=\"\"),\"* No olvide escribir en la celda de Pueblos Originarios (Digite CERO si no tiene). \",\"\"))","v":""},{"$f":"IF(AND(D46<>0,P46=\"\"),\"* No olvide escribir en la celda de Población Migrantes (Digite CERO si no tiene). \",IF(AND(E46<>0,Q46=\"\"),\"* No olvide escribir en la celda de Población Migrantes (Digite CERO si no tiene). \",\"\"))","v":""},null,null,null,null,null,null,{"$f":"IF($C$12<$C46, 1,0)","v":0},{"$f":"IF($C46<$L46, 1,0)","v":0},{"$f":"IF($C46<$O46, 1,0)","v":0},{"$f":"IF(AND(D46<>0,M46=\"\"),1,IF(AND(E46<>0,N46=\"\"),1,0))","v":0},{"$f":"IF(AND(D46<>0,P46=\"\"),1,IF(AND(E46<>0,Q46=\"\"),1,0))","v":0}]
["DESERCIÓN ESCOLAR",null,0,{"$f":"+G47+J47","v":0},{"$f":"+H47+K47","v":0},0,null,null,0,null,null,0,null,null,0,null,null," ",null,null,null,null,null,null,null,null,null,null,null,null,null,null,null,null,null,{"$f":"IF($C$12<$C47, \"* El total de Adolescentes según educacion y trabajo no puede ser mayor al total de Adolescentes en control. \", \"\")","v":""},"","","","",null,null,null,null,null,null,{"$f":"IF($C$12<$C47, 1,0)","v":0},0,0,0,0]
["TRABAJO INFANTIL",null,0,{"$f":"+G48","v":0},{"$f":"+H48","v":0},0,null,null,0,null,null,0,null,null,0,null,null," ",null,null,null,null,null,null,null,null,null,null,null,null,null,null,null,null,null,{"$f":"IF($C$12<$C48, \"* El total de Adolescentes según educacion y trabajo no puede ser mayor al total de Adolescentes en control. \", \"\")","v":""},"","","","",null,null,null,null,null,null,0,0,0,0,0]
["TRABAJO JUVENIL",null,{"$f":"SUM(D49:E49)","v":0},{"$f":"+J49","v":0},{"$f":"+K49","v":0},{"$f":"SUM(G49:H49)","v":0},null,null,0,null,null,0,null,null,0,null,null," ",null,null,null,null,null,null,null,null,null,null,null,null,null,null,null,null,null,{"$f":"IF($C$12<$C49, \"* El total de Adolescentes según educacion y trabajo no puede ser mayor al total de Adolescentes en control. \", \"\")","v":""},"","","","",null,null,null,null,null,null,0,0,0,0,0]
["PEORES FORMAS DE TRABAJO INFANTIL",null,0,0,0,0,null,null,0,null,null,0,null,null,0,null,null," ",null,null,null,null,null,null,null,null,null,null,null,null,null,null,null,null,null,{"$f":"IF($C$12<$C50, \"* El total de Adolescentes según educacion y trabajo no puede ser mayor al total de Adolescentes en control. \", \"\")","v":""},"","","","",null,null,null,null,null,null,0,0,0,0,0]
["SERVICIO DOMESTICO NO REMUNERADO PELIGROSO",null,0,0,0,0,null,null,0,null,null,0,null,null,0,null,null," ",null,null,null,null,null,null,null,null,null,null,null,null,null,null,null,null,null,{"$f":"IF($C$12<$C51, \"* El total de Adolescentes según educacion y trabajo no puede ser mayor al total de Adolescentes en control. \", \"\")","v":""},"","","","",null,null,null,null,null,null,0,0,0,0,0]
["SECCION C: POBLACIÓN EN CONTROL SALUD INTEGRAL DE ADOLESCENTES, SEGÚN ÁREAS DE RIESGO"]
["Áreas de Riesgo",null,"TOTAL",null,null,"Adolescentes 10-14 años",null,null,"Adolescentes 15 - 19 años",null,null,"Adolescentes de Pueblos Originarios",null,null,"Adolescentes Migrantes"]
[]
[]
[null,null,"Ambos sexos","Hombre","Mujer","Ambos sexos","Hombre","Mujer","Ambos sexos","Hombre","Mujer","Ambos sexos","Hombre","Mujer","Ambos sexos","Hombre","Mujer"]
["SALUD SEXUAL Y REPRODUCTIVA",null,{"$f":"SUM(D57:E57)","v":0},{"$f":"+G57+J57","v":0},{"$f":"+H57+K57","v":0},{"$f":"SUM(G57:H57)","v":0},null,null,{"$f":"SUM(J57:K57)","v":0},null,null,{"$f":"SUM(M57:N57)","v":0},null,null,{"$f":"SUM(P57:Q57)","v":0},null,null,{"$f":"AJ57 & \" \" & AK57 & AL57 & AM57 & AN57","v":" "},null,null,null,null,null,null,null,null,null,null,null,null,null,null,null,null,null,{"$f":"IF($C$12<$C57, \"* El total de Adolescentes según areas de riesgo no puede ser mayor al total de Adolescentes en control. \", \"\")","v":""},{"$f":"IF($C57<$L57, \"* El total de Adolescentes de Pueblos Originarios no puede ser mayor al total de Adolescentes. \", \"\")","v":""},{"$f":"IF($C57<$O57, \"* El total de Adolescentes de Migrantes no puede ser mayor al total de Adolescentes. \", \"\")","v":""},{"$f":"IF(AND(D57<>0,M57=\"\"),\"* No olvide escribir en la celda de Pueblos Originarios (Digite CERO si no tiene). \",IF(AND(E57<>0,N57=\"\"),\"* No olvide escribir en la celda de Pueblos Originarios (Digite CERO si no tiene). \",\"\"))","v":""},{"$f":"IF(AND(D57<>0,P57=\"\"),\"* No olvide escribir en la celda de Población Migrantes (Digite CERO si no tiene). \",IF(AND(E57<>0,Q57=\"\"),\"* No olvide escribir en la celda de Población Migrantes (Digite CERO si no tiene). \",\"\"))","v":""},null,null,null,null,null,null,0,{"$f":"IF($C57<$L57, 1,0)","v":0},{"$f":"IF($C57<$O57, 1,0)","v":0},{"$f":"IF(AND(D57<>0,M57=\"\"),1,IF(AND(E57<>0,N57=\"\"),1,0))","v":0},{"$f":"IF(AND(D57<>0,P57=\"\"),1,IF(AND(E57<>0,Q57=\"\"),1,0))","v":0}]
["CON ANTECEDENTE DE INFECCION DE TRANSMISIÓN SEXUAL",null,{"$f":"SUM(D58:E58)","v":0},{"$f":"+G58+J58","v":0},{"$f":"+H58+K58","v":0},{"$f":"SUM(G58:H58)","v":0},null,null,{"$f":"SUM(J58:K58)","v":0},null,null,{"$f":"SUM(M58:N58)","v":0},null,null,{"$f":"SUM(P58:Q58)","v":0}]
["RIESGO SSR",null,0,0,0,0,null,null,{"$f":"SUM(J59:K59)","v":0},null,null,0,null,null,0]
["RIESGO SUICIDA",null,0,0,0,0,null,null,0,null,null,0,null,null,0,null,null," ",null,null,null,null,null,null,null,null,null,null,null,null,null,null,null,null,null,{"$f":"IF($C$12<$C60, \"* El total de Adolescentes según areas de riesgo no puede ser mayor al total de Adolescentes en control. \", \"\")","v":""},"","","","",null,null,null,null,null,null,0,0,0,0,0]
["RIESGO SOCIAL",null,0,0,0,0,null,null,0,null,null,0,null,null,0]
["PSICOEMOCIONAL",null,0,0,0,0,null,null,0,null,null,0,null,null,0]
["OH DROGAS",null,0,0,0,0,null,null,0,null,null,0,null,null,0]
["CONSUMO ALCOHOL Y DROGAS ",null,0,0,0,0,null,null,0,null,null,0,null,null,0,null,null," ",null,null,null,null,null,null,null,null,null,null,null,null,null,null,null,null,null,{"$f":"IF($C$12<$C64, \"* El total de Adolescentes según areras de riesgo no puede ser mayor al total de Adolescentes en control. \", \"\")","v":""},"","","","",null,null,null,null,null,null,0,0,0,0,0]
["CONSUMO DE TABACO",null,0,0,0,0,null,null,0,null,null,0,null,null,0]
["MALNUTRICION POR DEFICIT",null,0,0,0,0,null,null,0,null,null,0,null,null,0,null,null," ",null,null,null,null,null,null,null,null,null,null,null,null,null,null,null,null,null,{"$f":"IF($C$12<$C66, \"* El total de Adolescentes según areas de riesgo no puede ser mayor al total de Adolescentes en control. \", \"\")","v":""},"","","","",null,null,null,null,null,null,0,0,0,0,0]
["MALNUTRICION POR EXCESO",null,0,0,0,0,null,null,0,null,null,0,null,null,0]
["DESERCIÓN ESCOLAR",null,0,{"$f":"+G68+J68","v":0},0,0,null,null,0,null,null,0,null,null,0]
["OTRO",null,0,0,0,0,null,null,0,null,null,0,null,null,0,null,null," ",null,null,null,null,null,null,null,null,null,null,null,null,null,null,null,null,null,{"$f":"IF($C$12<$C69, \"* El total de Adolescentes según areas de riesgo no puede ser mayor al total de Adolescentes en control. \", \"\")","v":""},"","","","",null,null,null,null,null,null,0,0,0,0,0]
["SECCION D:POBLACIÓN EN CONTROL SALUD INTEGRAL DE ADOLESCENTES, SEGÚN AMBITOS GINECO-UROLOGICO/SEXUALIDAD"]
["Gineco/urologico/sexualidad",null,"TOTAL",null,null,"Adolescentes 10-14 años",null,null,"Adolescentes 15 - 19 años",null,null,"Adolescentes de Pueblos Originarios",null,null,"Adolescentes Migrantes"]
[]
[]
[null,null,"Ambos sexos","Hombre","Mujer","Ambos sexos","Hombre","Mujer","Ambos sexos","Hombre","Mujer","Ambos sexos","Hombre","Mujer","Ambos sexos","Hombre","Mujer"]
["ADOLESCENTES CON CONDUCTA POSTERGADORA",null,{"$f":"SUM(D75:E75)","v":0},{"$f":"+G75+J75","v":0},{"$f":"+H75+K75","v":0},{"$f":"SUM(G75:H75)","v":0},null,null,{"$f":"SUM(J75:K75)","v":0},null,null,{"$f":"SUM(M75:N75)","v":0},null,null,{"$f":"SUM(P75:Q75)","v":0},null,null,{"$f":"AJ75 & \" \" & AK75 & AL75 & AM75 & AN75","v":" "},null,null,null,null,null,null,null,null,null,null,null,null,null,null,null,null,null,{"$f":"IF($C$12<$C75, \"* El total de Adolescentes según ambitos no puede ser mayor al total de Adolescentes en control. \", \"\")","v":""},{"$f":"IF($C75<$L75, \"* El total de Adolescentes de Pueblos Originarios no puede ser mayor al total de Adolescentes. \", \"\")","v":""},{"$f":"IF($C75<$O75, \"* El total de Adolescentes de Migrantes no puede ser mayor al total de Adolescentes. \", \"\")","v":""},{"$f":"IF(AND(D75<>0,M75=\"\"),\"* No olvide escribir en la celda de Pueblos Originarios (Digite CERO si no tiene). \",IF(AND(E75<>0,N75=\"\"),\"* No olvide escribir en la celda de Pueblos Originarios (Digite CERO si no tiene). \",\"\"))","v":""},{"$f":"IF(AND(D75<>0,P75=\"\"),\"* No olvide escribir en la celda de Población Migrantes (Digite CERO si no tiene). \",IF(AND(E75<>0,Q75=\"\"),\"* No olvide escribir en la celda de Población Migrantes (Digite CERO si no tiene). \",\"\"))","v":""},null,null,null,null,null,null,0,{"$f":"IF($C75<$L75, 1,0)","v":0},{"$f":"IF($C75<$O75, 1,0)","v":0},{"$f":"IF(AND(D75<>0,M75=\"\"),1,IF(AND(E75<>0,N75=\"\"),1,0))","v":0},{"$f":"IF(AND(D75<>0,P75=\"\"),1,IF(AND(E75<>0,Q75=\"\"),1,0))","v":0}]
["ADOLESCENTES CON CONDUCTA ANTICIPADORA",null,{"$f":"SUM(D76:E76)","v":0},{"$f":"+G76+J76","v":0},{"$f":"+H76+K76","v":0},{"$f":"SUM(G76:H76)","v":0},null,null,{"$f":"SUM(J76:K76)","v":0},null,null,{"$f":"SUM(M76:N76)","v":0},null,null,{"$f":"SUM(P76:Q76)","v":0},null,null," ",null,null,null,null,null,null,null,null,null,null,null,null,null,null,null,null,null,"","","","","",null,null,null,null,null,null,0,0,0,0,0]
["ADOLESCENTES CON CONDUCTA ACTIVA",null,0,0,0,0,null,null,0,null,null,0,null,null,0,null,null," ",null,null,null,null,null,null,null,null,null,null,null,null,null,null,null,null,null,"","","","","",null,null,null,null,null,null,0,0,0,0,0]
["USO ACTUAL DE METODO ANTICONCEPTIVO",null,0,0,0,0,null,null,0,null,null,0,null,null,0,null,null," ",null,null,null,null,null,null,null,null,null,null,null,null,null,null,null,null,null,"","","","","",null,null,null,null,null,null,0,0,0,0,0]
["USO ACTUAL DE DOBLE PROTECCIÓN",null,0,0,0,0,null,null,0,null,null,0,null,null,0,null,null," ",null,null,null,null,null,null,null,null,null,null,null,null,null,null,null,null,null,"","","","","",null,null,null,null,null,null,0,0,0,0,0]
["ADOLESCENTE CON ANTECEDENTE DE UN PRIMER EMBARAZO",null,{"$f":"SUM(D80:E80)","v":0},{"$f":"+G80+J80","v":0},0,0,null,null,0,null,null,0,null,null,0,null,null," ",null,null,null,null,null,null,null,null,null,null,null,null,null,null,null,null,null,"","","","","",null,null,null,null,null,null,0,0,0,0,0]
["ADOLESCENTE CON ANTECEDENTE DE MAS DE UN EMBARAZO",null,0,0,0,0,null,null,0,null,null,0,null,null,0,null,null," ",null,null,null,null,null,null,null,null,null,null,null,null,null,null,null,null,null,"","","","","",null,null,null,null,null,null,0,0,0,0,0]
["ADOLESCENTE CON ANTECEDENTE DE ABORTO",null,0,0,0,0,null,null,0,null,null,0,null,null,0,null,null," ",null,null,null,null,null,null,null,null,null,null,null,null,null,null,null,null,null,"","","","","",null,null,null,null,null,null,0,0,0,0,0]
[]
["SECCION E:POBLACIÓN ADOLESCENTE QUE RECIBE CONSEJERÍA"]
["ACTIVIDAD Y AREA TEMATICA","Grupos de Edad","Total de Adolescentes que reciben Consejería",null,null,"Adolescentes de Pueblos Originarios",null,null,"Adolescentes Migrantes",null,null,"Espacios Amigables"]
[]
[null,null,"Ambos sexos","Hombre","Mujer","Ambos sexos","Hombre","Mujer","Ambos sexos","Hombre","Mujer","Ambos sexos","Hombre","Mujer"]
["ACTIVIDAD FÍSICA","10-14 años",{"$f":"SUM(D88:E88)","v":0},null,null,{"$f":"SUM(G88:H88)","v":0},null,null,{"$f":"SUM(J88:K88)","v":0},null,null,{"$f":"SUM(M88:N88)","v":0},null,null,{"$f":"AI88 & AJ88 & AK88 & AL88 & AM88 & AN88","v":""},null,null,null,null,null,null,null,null,null,null,null,null,null,null,null,null,null,null,null,{"$f":"IF($C88<$F88, \"* El total de Adolescentes de Pueblos Originarios no puede ser mayor al total de Adolescentes. \", \"\")","v":""},{"$f":"IF($C88<$I88, \"* El total de Adolescentes de Migrantes no puede ser mayor al total de Adolescentes. \", \"\")","v":""},{"$f":"IF($C88<$L88, \"* El total de Adolescentes de Espacios Amigables no puede ser mayor al total de Adolescentes. \", \"\")","v":""},{"$f":"IF(AND(D88<>0,G88=\"\"),\"* No olvide escribir en la celda de Pueblos Originarios (Digite CERO si no tiene). \",IF(AND(E88<>0,H88=\"\"),\"* No olvide escribir en la celda de Pueblos Originarios (Digite CERO si no tiene). \",\"\"))","v":""},{"$f":"IF(AND(D88<>0,J88=\"\"),\"* No olvide escribir en la celda de Población Migrantes (Digite CERO si no tiene). \",IF(AND(E88<>0,K88=\"\"),\"* No olvide escribir en la celda de Población Migrantes (Digite CERO si no tiene). \",\"\"))","v":""},{"$f":"IF(AND(D88<>0,M88=\"\"),\"* No olvide escribir en la celda de Espacios Amigables (Digite CERO si no tiene). \",IF(AND(E88<>0,N88=\"\"),\"* No olvide escribir en la celda de Espacios Amigables (Digite CERO si no tiene). \",\"\"))","v":""},null,null,null,null,null,{"$f":"IF($C88<$F88, 1,0)","v":0},{"$f":"IF($C88<$I88, 1,0)","v":0},{"$f":"IF($C88<$L88, 1,0)","v":0},{"$f":"IF(AND(D88<>0,G88=\"\"),1,IF(AND(E88<>0,H88=\"\"),1,0))","v":0},{"$f":"IF(AND(D88<>0,J88=\"\"),1,IF(AND(E88<>0,K88=\"\"),1,0))","v":0},{"$f":"IF(AND(D88<>0,M88=\"\"),1,IF(AND(E88<>0,N88=\"\"),1,0))","v":0}]
[null,"15 - 19 años",{"$f":"SUM(D89:E89)","v":0},null,null,{"$f":"SUM(G89:H89)","v":0},null,null,{"$f":"SUM(J89:K89)","v":0},null,null,{"$f":"SUM(M89:N89)","v":0},null,null,{"$f":"AI89 & AJ89 & AK89 & AL89 & AM89 & AN89","v":""},null,null,null,null,null,null,null,null,null,null,null,null,null,null,null,null,null,null,null,"","",{"$f":"IF($C89<$L89, \"* El total de Adolescentes de Espacios Amigables no puede ser mayor al total de Adolescentes. \", \"\")","v":""},"","",{"$f":"IF(AND(D89<>0,M89=\"\"),\"* No olvide escribir en la celda de Espacios Amigables (Digite CERO si no tiene). \",IF(AND(E89<>0,N89=\"\"),\"* No olvide escribir en la celda de Espacios Amigables (Digite CERO si no tiene). \",\"\"))","v":""},null,null,null,null,null,{"$f":"IF($C89<$F89, 1,0)","v":0},{"$f":"IF($C89<$I89, 1,0)","v":0},{"$f":"IF($C89<$L89, 1,0)","v":0},0,0,{"$f":"IF(AND(D89<>0,M89=\"\"),1,IF(AND(E89<>0,N89=\"\"),1,0))","v":0}]
["ALIMENTACION SALUDABLE","10-14 años",{"$f":"SUM(D90:E90)","v":0},null,null,0,null,null,0,null,null,0,null,null,"",null,null,null,null,null,null,null,null,null,null,null,null,null,null,null,null,null,null,null,"","","","","","",null,null,null,null,null,0,0,0,0,0,0]
[null,"15 - 19 años",0,null,null,0,null,null,0,null,null,{"$f":"SUM(M91:N91)","v":0},null,null,"",null,null,null,null,null,null,null,null,null,null,null,null,null,null,null,null,null,null,null,"","","","","","",null,null,null,null,null,0,0,0,0,0,0]
["TABAQUISMO","10-14 años",0,null,null,0,null,null,0,null,null,0,null,null,"",null,null,null,null,null,null,null,null,null,null,null,null,null,null,null,null,null,null,null,"","","","","","",null,null,null,null,null,0,0,0,0,0,0]
[null,"15 - 19 años",0,null,null,0,null,null,0,null,null,0,null,null,"",null,null,null,null,null,null,null,null,null,null,null,null,null,null,null,null,null,null,null,"","","","","","",null,null,null,null,null,0,0,0,0,0,0]
["CONSUMO DE DROGAS","10-14 años",0,null,null,0,null,null,0,null,null,0,null,null,"",null,null,null,null,null,null,null,null,null,null,null,null,null,null,null,null,null,null,null,"","","","","","",null,null,null,null,null,0,0,0,0,0,0]
[null,"15 - 19 años",0,null,null,0,null,null,0,null,null,0,null,null,"",null,null,null,null,null,null,null,null,null,null,null,null,null,null,null,null,null,null,null,"","","","","","",null,null,null,null,null,0,0,0,0,0,0]
["SALUD SEXUAL REPRODUCTIVA","10-14 años",0,null,null,0,null,null,0,null,null,0,null,null,"",null,null,null,null,null,null,null,null,null,null,null,null,null,null,null,null,null,null,null,"","","","","","",null,null,null,null,null,0,0,0,0,0,0]
[null,"15 - 19 años",0,null,null,0,null,null,0,null,null,0,null,null,"",null,null,null,null,null,null,null,null,null,null,null,null,null,null,null,null,null,null,null,"","","","","","",null,null,null,null,null,0,0,0,0,0,0]
["REGULACION DE FECUNDIDAD","10-14 años",0,null,null,0,null,null,0,null,null,0,null,null,"",null,null,null,null,null,null,null,null,null,null,null,null,null,null,null,null,null,null,null,"","","","","","",null,null,null,null,null,0,0,0,0,0,0]
[null,"15 - 19 años",0,null,null,0,null,null,0,null,null,0,null,null,"",null,null,null,null,null,null,null,null,null,null,null,null,null,null,null,null,null,null,null,"","","","","","",null,null,null,null,null,0,0,0,0,0,0]
["PREVENCION VIH-ITS","10-14 años",0,null,null,0,null,null,0,null,null,{"$f":"SUM(M100:N100)","v":0},null,null,"",null,null,null,null,null,null,null,null,null,null,null,null,null,null,null,null,null,null,null,"","","","","","",null,null,null,null,null,0,0,0,0,0,0]
[null,"15 - 19 años",0,null,null,0,null,null,0,null,null,{"$f":"SUM(M101:N101)","v":0},null,null,"",null,null,null,null,null,null,null,null,null,null,null,null,null,null,null,null,null,null,null,"","","","","","",null,null,null,null,null,0,0,0,0,0,0]
[]
[]
[]
[]
[]
[{"$f":"SUM(C12:Q40,C46:Q51,C57:Q69,C75:Q82,C88:N101)","v":0},"datos"]
[{"$f":"SUM(AT11:AY102)","v":0},"errores"]

{"sheet":"P11","index":9,"n_rows":34,"n_cols":74,"rows_kept":34,"cut":false,"hidden":false,"merged":[[18,70,19,70],[18,71,19,71],[18,72,19,72],[8,67,10,67],[8,68,10,68],[18,60,19,60],[18,61,19,61],[18,66,19,67],[18,68,20,68],[18,69,20,69],[8,48,10,48],[18,55,19,56],[18,57,20,57],[18,58,20,58],[18,59,19,59],[8,49,10,49],[18,0,20,0],[18,1,19,3],[18,4,18,31],[19,4,19,5],[19,6,19,7],[19,10,19,11],[19,12,19,13],[19,14,19,15],[19,8,19,9],[19,18,19,19],[19,22,19,23],[19,30,19,31],[19,20,19,21],[19,16,19,17],[19,24,19,25],[19,26,19,27],[9,24,9,25],[9,18,9,19],[9,22,9,23],[9,20,9,21],[6,0,6,16],[8,6,8,43],[9,36,9,37],[9,14,9,15],[9,16,9,17],[9,38,9,39],[9,34,9,35],[9,26,9,27],[9,32,9,33],[9,28,9,29],[9,30,9,31],[8,3,9,5],[11,1,12,1],[8,0,10,2],[13,1,14,1],[8,47,10,47],[18,35,20,35],[18,34,20,34],[8,46,10,46],[9,42,9,43],[9,40,9,41],[8,44,9,45],[18,32,19,33],[19,28,19,29],[9,6,9,7],[9,8,9,9],[9,10,9,11],[9,12,9,13],[15,0,16,0],[8,73,9,73],[8,58,10,58],[8,69,10,69],[8,72,9,72],[8,54,9,55],[8,56,10,56],[8,59,9,59],[8,57,10,57],[8,60,9,60],[8,70,9,70],[8,71,9,71],[8,62,9,62],[8,61,9,61],[8,65,9,66],[11,0,14,0]]}
["DATOS DEL ESTABLECIMIENTO"]
[{"$f":"CONCATENATE(\"COMUNA: \",NOMBRE!$B$2,\" - \",\"( \",NOMBRE!$C$2,NOMBRE!$D$2,NOMBRE!$E$2,NOMBRE!$F$2,NOMBRE!$G$2,\" )\")","v":"COMUNA:  - (  )"}]
[{"$f":"CONCATENATE(\"ESTABLECIMIENTO/ESTRATEGIA: \",NOMBRE!$B$3,\" - \",\"( \",NOMBRE!$C$3,NOMBRE!$D$3,NOMBRE!$E$3,NOMBRE!$F$3,NOMBRE!$G$3,NOMBRE!$H$3,\" )\")","v":"ESTABLECIMIENTO/ESTRATEGIA:  - (  )"}]
[{"$f":"CONCATENATE(\"MES: \",NOMBRE!$B$6,\" - \",\"( \",NOMBRE!$C$6,NOMBRE!$D$6,\" )\")","v":"MES:  - (  )"}]
[{"$f":"CONCATENATE(\"AÑO: \",NOMBRE!$B$7)","v":"AÑO: 2023"}]
[]
["REM-P11. POBLACIÓN EN CONTROL PROGRAMA DE INFECCIONES DE TRASMISIÓN SEXUAL - VIH / SIDA"]
["SECCION A: POBLACIÓN EN CONTROL DEL PROGRAMA DE VIH/SIDA (Uso exclusivo Centros de Atención VIH-SIDA)"]
["CONCEPTO",null,null,"TOTAL",null,null,"GRUPOS DE EDAD (en años)",null,null,null,null,null,null,null,null,null,null,null,null,null,null,null,null,null,null,null,null,null,null,null,null,null,null,null,null,null,null,null,null,null,null,null,null,null,"TRANS",null,"Pueblos Originarios","Población Migrantes","Niños, Niñas, Adolescentes y Jóvenes SENAME","Niños, Niñas, Adolescentes y Jóvenes Mejor Niñez",null,null,null,null,"TRANS",null,"Pueblos Originarios","Población Migrantes","Población SENAME","TRANS","Pueblos Originarios","Población Migrantes","Población SENAME",null,null,"TRANS",null,"Pueblos Originarios","Población Migrantes","Población SENAME","TRANS","Pueblos Originarios","Población Migrantes","Población SENAME"]
[null,null,null,null,null,null,"Menor 1 Año",null,"1 año",null,"2 a 4 años",null,"5 a 9 años",null,"10 a 14 años",null,"15 a 19 años",null,"20 a 24 años",null,"25 a 29 años",null,"30 a 34 años",null,"35 a 39 años",null,"40 a 44 años",null,"45 a 49 años",null,"50 a 54 años",null,"55 a 59 años",null,"60 a 64 años",null,"65 a 69 años",null,"70 a 74 años",null,"75 a 79 años",null,"80 y más años"]
[null,null,null,"Ambos\nsexos","Hombres","Mujeres","Hombres ","Mujeres","Hombres ","Mujeres","Hombres ","Mujeres","Hombres ","Mujeres","Hombres ","Mujeres","Hombres ","Mujeres","Hombres ","Mujeres","Hombres ","Mujeres","Hombres ","Mujeres","Hombres ","Mujeres","Hombres ","Mujeres","Hombres ","Mujeres","Hombres ","Mujeres","Hombres ","Mujeres","Hombres ","Mujeres","Hombres ","Mujeres","Hombres ","Mujeres","Hombres ","Mujeres","Hombres ","Mujeres","Masculino","Femenino",null,null,null,null,null,null,null,null,"Masculino","Femenino (NO)",null,null,null,"No Olvide","No Olvide","No Olvide","No Olvide",null,null,"Masculino","Femenino (NO)",null,null,null,"No Olvide","No Olvide","No Olvide","No Olvide"]
["Nº TOTAL DE PERSONAS CON VIH/SIDA","GESTANTES","Inicia TARV en este embarazo",{"$f":"SUM(E12:F12)","v":0},null,{"$f":"+P12+R12+T12+V12+X12+Z12+AB12+AD12+AF12+AH12","v":0},null,null,null,null,null,null,null,null,null,null,null,null,null,null,null,null,null,null,null,null,null,null,null,null,null,null,null,null,null,null,null,null,null,null,null,null,null,null,null,null,null,null,null,null,null,null,null,null,{"$f":"IF(($AS12+$AT12)<=$F12,\"\",\"* La suma de las celdas 'Trans' no debe ser mayor al Total de personas bajo control. \")","v":""},null,{"$f":"IF($AU12<=$F12,\"\",\"* La celda de 'Pueblos Originarios' no debe ser mayor al Total de personas bajo control. \")","v":""},{"$f":"IF($AV12<=$F12,\"\",\"* La celda de 'Población Migrantes' no debe ser mayor al Total de personas bajo control. \")","v":""},{"$f":"IF($AW12<=$F12,\"\",\"* La celda de 'Población SENAME' no debe ser mayor al Total de personas bajo control. \")","v":""},{"$f":"IF(AND($F12<>0,$AT12=\"\"),\"* No olvide escribir en la celda de Trans (Digite CERO si no tiene). \",IF(AND(D12<>0,AS12=\"\"),\"* No olvide escribir en la celda Trans (Digite CERO si no tiene). \",\"\"))","v":""},{"$f":"IF(AND($F12<>0,$AU12=\"\"),\"* No olvide escribir en la celda de Pueblos Originarios (Digite CERO si no tiene). \",\"\")","v":""},{"$f":"IF(AND($F12<>0,$AV12=\"\"),\"* No olvide escribir en la celda de Población Migrantes (Digite CERO si no tiene). \",\"\")","v":""},{"$f":"IF(AND($F12<>0,$AW12=\"\"),\"* No olvide escribir en la celda de Población SENAME (Digite CERO si no tiene). \",\"\")","v":""},null,null,{"$f":"IF(($AS12+$AT12)<=$F12,0,1)","v":0},null,{"$f":"IF($AU12<=$F12,0,1)","v":0},{"$f":"IF($AV12<=$F12,0,1)","v":0},{"$f":"IF($AW12<=$F12,0,1)","v":0},{"$f":"IF(AND($F12<>0,$AT12=\"\"),1,0)","v":0},{"$f":"IF(AND($F12<>0,$AU12=\"\"),1,0)","v":0},{"$f":"IF(AND($F12<>0,$AV12=\"\"),1,0)","v":0},{"$f":"IF(AND($F12<>0,$AW12=\"\"),1,0)","v":0}]
[null,null,"en TARV previa",{"$f":"SUM(E13:F13)","v":0},null,{"$f":"+P13+R13+T13+V13+X13+Z13+AB13+AD13+AF13+AH13","v":0},null,null,null,null,null,null,null,null,null,null,null,null,null,null,null,null,null,null,null,null,null,null,null,null,null,null,null,null,null,null,null,null,null,null,null,null,null,null,null,null,null,null,null,null,null,null,null,null,{"$f":"IF(($AS13+$AT13)<=$F13,\"\",\"* La suma de las celdas 'Trans' no debe ser mayor al Total de personas bajo control. \")","v":""},null,{"$f":"IF($AU13<=$F13,\"\",\"* La celda de 'Pueblos Originarios' no debe ser mayor al Total de personas bajo control. \")","v":""},{"$f":"IF($AV13<=$F13,\"\",\"* La celda de 'Población Migrantes' no debe ser mayor al Total de personas bajo control. \")","v":""},{"$f":"IF($AW13<=$F13,\"\",\"* La celda de 'Población SENAME' no debe ser mayor al Total de personas bajo control. \")","v":""},{"$f":"IF(AND($F13<>0,$AT13=\"\"),\"* No olvide escribir en la celda de Trans (Digite CERO si no tiene). \",IF(AND(D13<>0,AS13=\"\"),\"* No olvide escribir en la celda Trans (Digite CERO si no tiene). \",\"\"))","v":""},{"$f":"IF(AND($F13<>0,$AU13=\"\"),\"* No olvide escribir en la celda de Pueblos Originarios (Digite CERO si no tiene). \",\"\")","v":""},{"$f":"IF(AND($F13<>0,$AV13=\"\"),\"* No olvide escribir en la celda de Población Migrantes (Digite CERO si no tiene). \",\"\")","v":""},{"$f":"IF(AND($F13<>0,$AW13=\"\"),\"* No olvide escribir en la celda de Población SENAME (Digite CERO si no tiene). \",\"\")","v":""},null,null,{"$f":"IF(($AS13+$AT13)<=$F13,0,1)","v":0},null,{"$f":"IF($AU13<=$F13,0,1)","v":0},{"$f":"IF($AV13<=$F13,0,1)","v":0},{"$f":"IF($AW13<=$F13,0,1)","v":0},{"$f":"IF(AND($F13<>0,$AT13=\"\"),1,0)","v":0},{"$f":"IF(AND($F13<>0,$AU13=\"\"),1,0)","v":0},{"$f":"IF(AND($F13<>0,$AV13=\"\"),1,0)","v":0},{"$f":"IF(AND($F13<>0,$AW13=\"\"),1,0)","v":0}]
[null,"NO GESTANTES","Con TARV",{"$f":"SUM(E14:F14)","v":0},{"$f":"+G14+I14+K14+M14+O14+Q14+S14+U14+W14+Y14+AA14+AC14+AE14+AG14+AI14+AK14+AM14+AO14+AQ14","v":0},{"$f":"+H14+J14+L14+N14+P14+R14+T14+V14+X14+Z14+AB14+AD14+AF14+AH14+AJ14+AL14+AN14+AP14+AR14","v":0},null,null,null,null,null,null,null,null,null,null,null,null,null,null,null,null,null,null,null,null,null,null,null,null,null,null,null,null,null,null,null,null,null,null,null,null,null,null,null,null,null,null,null,null,null,null,null,null,{"$f":"IF(($AS14+$AT14)<=$D14,\"\",\"* La suma de las celdas 'Trans' no debe ser mayor al Total de personas bajo control. \")","v":""},null,{"$f":"IF($AU14<=$D14,\"\",\"* La celda de 'Pueblos Originarios' no debe ser mayor al Total de personas bajo control. \")","v":""},{"$f":"IF($AV14<=$D14,\"\",\"* La celda de 'Población Migrantes' no debe ser mayor al Total de personas bajo control. \")","v":""},{"$f":"IF($AW14<=$D14,\"\",\"* La celda de 'Población SENAME' no debe ser mayor al Total de personas bajo control. \")","v":""},{"$f":"IF(AND($D14<>0,$AT14=\"\"),\"* No olvide escribir en la celda de Trans (Digite CERO si no tiene). \",IF(AND(D14<>0,AS14=\"\"),\"* No olvide escribir en la celda Trans (Digite CERO si no tiene). \",\"\"))","v":""},{"$f":"IF(AND($D14<>0,$AU14=\"\"),\"* No olvide escribir en la celda de Pueblos Originarios (Digite CERO si no tiene). \",\"\")","v":""},{"$f":"IF(AND($D14<>0,$AV14=\"\"),\"* No olvide escribir en la celda de Población Migrantes (Digite CERO si no tiene). \",\"\")","v":""},{"$f":"IF(AND($D14<>0,$AW14=\"\"),\"* No olvide escribir en la celda de Población SENAME (Digite CERO si no tiene). \",\"\")","v":""},null,null,{"$f":"IF(($AS14+$AT14)<=$D14,0,1)","v":0},null,{"$f":"IF($AU14<=$D14,0,1)","v":0},{"$f":"IF($AV14<=$D14,0,1)","v":0},{"$f":"IF($AW14<=$D14,0,1)","v":0},{"$f":"IF(AND($D14<>0,$AT14=\"\"),1,0)","v":0},{"$f":"IF(AND($D14<>0,$AU14=\"\"),1,0)","v":0},{"$f":"IF(AND($D14<>0,$AV14=\"\"),1,0)","v":0},{"$f":"IF(AND($D14<>0,$AW14=\"\"),1,0)","v":0}]
[null,null,"Sin TARV",{"$f":"SUM(E15:F15)","v":0},{"$f":"+G15+I15+K15+M15+O15+Q15+S15+U15+W15+Y15+AA15+AC15+AE15+AG15+AI15+AK15+AM15+AO15+AQ15","v":0},{"$f":"+H15+J15+L15+N15+P15+R15+T15+V15+X15+Z15+AB15+AD15+AF15+AH15+AJ15+AL15+AN15+AP15+AR15","v":0},null,null,null,null,null,null,null,null,null,null,null,null,null,null,null,null,null,null,null,null,null,null,null,null,null,null,null,null,null,null,null,null,null,null,null,null,null,null,null,null,null,null,null,null,null,null,null,null,{"$f":"IF(($AS15+$AT15)<=$D15,\"\",\"* La suma de las celdas 'Trans' no debe ser mayor al Total de personas bajo control. \")","v":""},null,{"$f":"IF($AU15<=$D15,\"\",\"* La celda de 'Pueblos Originarios' no debe ser mayor al Total de personas bajo control. \")","v":""},{"$f":"IF($AV15<=$D15,\"\",\"* La celda de 'Población Migrantes' no debe ser mayor al Total de personas bajo control. \")","v":""},{"$f":"IF($AW15<=$D15,\"\",\"* La celda de 'Población SENAME' no debe ser mayor al Total de personas bajo control. \")","v":""},{"$f":"IF(AND($D15<>0,$AT15=\"\"),\"* No olvide escribir en la celda de Trans (Digite CERO si no tiene). \",IF(AND(D15<>0,AS15=\"\"),\"* No olvide escribir en la celda Trans (Digite CERO si no tiene). \",\"\"))","v":""},{"$f":"IF(AND($D15<>0,$AU15=\"\"),\"* No olvide escribir en la celda de Pueblos Originarios (Digite CERO si no tiene). \",\"\")","v":""},{"$f":"IF(AND($D15<>0,$AV15=\"\"),\"* No olvide escribir en la celda de Población Migrantes (Digite CERO si no tiene). \",\"\")","v":""},{"$f":"IF(AND($D15<>0,$AW15=\"\"),\"* No olvide escribir en la celda de Población SENAME (Digite CERO si no tiene). \",\"\")","v":""},null,null,{"$f":"IF(($AS15+$AT15)<=$D15,0,1)","v":0},null,{"$f":"IF($AU15<=$D15,0,1)","v":0},{"$f":"IF($AV15<=$D15,0,1)","v":0},{"$f":"IF($AW15<=$D15,0,1)","v":0},{"$f":"IF(AND($D15<>0,$AT15=\"\"),1,0)","v":0},{"$f":"IF(AND($D15<>0,$AU15=\"\"),1,0)","v":0},{"$f":"IF(AND($D15<>0,$AV15=\"\"),1,0)","v":0},{"$f":"IF(AND($D15<>0,$AW15=\"\"),1,0)","v":0}]
["N° DE PERSONAS EN TARV","GESTANTES","Con carga viral <a 1000 copias",{"$f":"SUM(E16:F16)","v":0},null,{"$f":"+P16+R16+T16+V16+X16+Z16+AB16+AD16+AF16+AH16","v":0},null,null,null,null,null,null,null,null,null,null,null,null,null,null,null,null,null,null,null,null,null,null,null,null,null,null,null,null,null,null,null,null,null,null,null,null,null,null,null,null,null,null,null,null,null,null,null,null,{"$f":"IF(($AS16+$AT16)<=$D16,\"\",\"* La suma de las celdas 'Trans' no debe ser mayor al Total de personas bajo control. \")","v":""},null,{"$f":"IF($AU16<=$D16,\"\",\"* La celda de 'Pueblos Originarios' no debe ser mayor al Total de personas bajo control. \")","v":""},{"$f":"IF($AV16<=$D16,\"\",\"* La celda de 'Población Migrantes' no debe ser mayor al Total de personas bajo control. \")","v":""},{"$f":"IF($AW16<=$D16,\"\",\"* La celda de 'Población SENAME' no debe ser mayor al Total de personas bajo control. \")","v":""},{"$f":"IF(AND($D16<>0,$AT16=\"\"),\"* No olvide escribir en la celda de Trans (Digite CERO si no tiene). \",IF(AND(D16<>0,AS16=\"\"),\"* No olvide escribir en la celda Trans (Digite CERO si no tiene). \",\"\"))","v":""},{"$f":"IF(AND($D16<>0,$AU16=\"\"),\"* No olvide escribir en la celda de Pueblos Originarios (Digite CERO si no tiene). \",\"\")","v":""},{"$f":"IF(AND($D16<>0,$AV16=\"\"),\"* No olvide escribir en la celda de Población Migrantes (Digite CERO si no tiene). \",\"\")","v":""},{"$f":"IF(AND($D16<>0,$AW16=\"\"),\"* No olvide escribir en la celda de Población SENAME (Digite CERO si no tiene). \",\"\")","v":""},null,null,{"$f":"IF(($AS16+$AT16)<=$D16,0,1)","v":0},null,{"$f":"IF($AU16<=$D16,0,1)","v":0},{"$f":"IF($AV16<=$D16,0,1)","v":0},{"$f":"IF($AW16<=$D16,0,1)","v":0},{"$f":"IF(AND($D16<>0,$AT16=\"\"),1,0)","v":0},{"$f":"IF(AND($D16<>0,$AU16=\"\"),1,0)","v":0},{"$f":"IF(AND($D16<>0,$AV16=\"\"),1,0)","v":0},{"$f":"IF(AND($D16<>0,$AW16=\"\"),1,0)","v":0}]
[null,"NO GESTANTES","Con carga viral <a 1000 copias",0,{"$f":"+G17+I17+K17+M17+O17+Q17+S17+U17+W17+Y17+AA17+AC17+AE17+AG17+AI17+AK17+AM17+AO17+AQ17","v":0},{"$f":"+H17+J17+L17+N17+P17+R17+T17+V17+X17+Z17+AB17+AD17+AF17+AH17+AJ17+AL17+AN17+AP17+AR17","v":0},null,null,null,null,null,null,null,null,null,null,null,null,null,null,null,null,null,null,null,null,null,null,null,null,null,null,null,null,null,null,null,null,null,null,null,null,null,null,null,null,null,null,null,null,null,null,null,null,"",null,"","","","","","","",null,null,0,null,0,0,0,0,0,0,0]
["SECCION B: POBLACIÓN EN CONTROL POR COMERCIO SEXUAL (Uso exclusivo de Unidades Control Comercio Sexual)"]
["CONCEPTO","TOTAL",null,null,"GRUPOS DE EDAD (en años)",null,null,null,null,null,null,null,null,null,null,null,null,null,null,null,null,null,null,null,null,null,null,null,null,null,null,null,"TRANS",null,"Pueblos Originarios","Población Migrantes",null,null,null,null,null,null,null,null,null,null,null,null,null,null,null,null,null,null,null,"TRANS",null,"Pueblos Originarios","Población Migrantes","TRANS","Pueblos Originarios","Población Migrantes",null,null,null,null,"TRANS",null,"Pueblos Originarios","Población Migrantes","TRANS","Pueblos Originarios","Población Migrantes"]
[null,null,null,null,"15 a 19 años",null,"20 a 24 años",null,"25 a 29 años",null,"30 a 34 años",null,"35 a 39 años",null,"40 a 44 años",null,"45 a 49 años",null,"50 a 54 años",null,"55 a 59 años",null,"60 a 64 años",null,"65 a 69 años",null,"70 a 74 años",null,"75 a 79 años",null,"80 y más años"]
[null,"Ambos\nsexos","Hombres","Mujeres","Hombres ","Mujeres","Hombres ","Mujeres","Hombres ","Mujeres","Hombres ","Mujeres","Hombres ","Mujeres","Hombres ","Mujeres","Hombres ","Mujeres","Hombres ","Mujeres","Hombres ","Mujeres","Hombres ","Mujeres","Hombres ","Mujeres","Hombres ","Mujeres","Hombres ","Mujeres","Hombres ","Mujeres","Masculino","Femenino",null,null,null,null,null,null,null,null,null,null,null,null,null,null,null,null,null,null,null,null,null,"Masculino","Femenino (NO)",null,null,"No Olvide","No Olvide","No Olvide",null,null,null,null,"Masculino","Femenino (NO)",null,null,"No Olvide","No Olvide","No Olvide"]
["Nº DE PERSONAS / COMERCIO SEXUAL",{"$f":"SUM(C22:D22)","v":0},{"$f":"+E22+G22+I22+K22+M22+O22+Q22+S22+U22+W22+Y22+AA22+AC22+AE22","v":0},{"$f":"+F22+H22+J22+L22+N22+P22+R22+T22+V22+X22+Z22+AB22+AD22+AF22","v":0},null,null,null,null,null,null,null,null,null,null,null,null,null,null,null,null,null,null,null,null,null,null,null,null,null,null,null,null,null,null,null,null,{"$f":" BD22 & BE22 & BF22 & BG22 & BH22 & BI22 & BJ22","v":""},null,null,null,null,null,null,null,null,null,null,null,null,null,null,null,null,null,null,{"$f":"IF(($AG22+$AH22)<=$B22,\"\",\"* La suma de las celdas 'Trans' no debe ser mayor al Total de personas bajo control. \")","v":""},null,{"$f":"IF($AI22<=$B22,\"\",\"* La celda de 'Pueblos Originarios' no debe ser mayor al Total de personas bajo control. \")","v":""},{"$f":"IF($AJ22<=$B22,\"\",\"* La celda de 'Población Migrantes' no debe ser mayor al Total de personas bajo control. \")","v":""},{"$f":"IF(AND($B22<>0,$AG22=\"\"),\"* No olvide escribir en la celda de Trans (Digite CERO si no tiene). \",IF(AND($B22<>0,$AH22=\"\"),\"* No olvide escribir en la celda Trans (Digite CERO si no tiene). \",\"\"))","v":""},{"$f":"IF(AND($B22<>0,$AI22=\"\"),\"* No olvide escribir en la celda de Pueblos Originarios (Digite CERO si no tiene). \",\"\")","v":""},{"$f":"IF(AND($B22<>0,$AJ22=\"\"),\"* No olvide escribir en la celda de Población Migrantes (Digite CERO si no tiene). \",\"\")","v":""},null,null,null,null,{"$f":"IF(($AG22+$AH22)<=$B22,0,1)","v":0},{"$f":"IF($AH22<=$D22,0,0)","v":0},{"$f":"IF($AI22<=$B22,0,1)","v":0},{"$f":"IF($AJ22<=$B22,0,1)","v":0},{"$f":"IF(AND($B22<>0,$AG22=\"\"),1,IF(AND($B22<>0,$AH22=\"\"),1,0))","v":0},{"$f":"IF(AND($B22<>0,$AI22=\"\"),1,0)","v":0},{"$f":"IF(AND($B22<>0,$AJ22=\"\"),1,0)","v":0}]
[]
[]
[]
[]
[]
[]
[]
[]
[]
[]
[{"$f":"SUM(D12:AV14,B22:AJ22)","v":0},"datos"]
[{"$f":"SUM(BN12:BV22)","v":0},"errores"]

{"sheet":"P12","index":10,"n_rows":200,"n_cols":12,"rows_kept":200,"cut":false,"hidden":false,"merged":[[116,0,118,0],[116,1,116,6],[117,1,118,1],[117,2,118,2],[117,3,117,5],[117,6,118,6],[115,0,115,10],[98,0,98,10],[99,0,101,0],[99,1,99,6],[100,1,101,1],[100,2,101,2],[100,3,100,5],[100,6,101,6],[23,0,23,2],[4,13,4,14],[6,0,6,10],[24,0,24,10],[26,5,26,10],[25,0,27,0],[26,1,27,1],[26,2,27,2],[26,3,26,4],[25,1,25,11],[26,11,27,11],[42,0,42,2],[43,0,43,10],[44,0,46,0],[45,1,46,1],[45,2,46,2],[45,3,45,4],[45,5,45,10],[44,1,44,11],[45,11,46,11]]}
["DATOS DEL ESTABLECIMIENTO"]
[{"$f":"CONCATENATE(\"COMUNA: \",NOMBRE!$B$2,\" - \",\"( \",NOMBRE!$C$2,NOMBRE!$D$2,NOMBRE!$E$2,NOMBRE!$F$2,NOMBRE!$G$2,\" )\")","v":"COMUNA:  - (  )"}]
[{"$f":"CONCATENATE(\"ESTABLECIMIENTO/ESTRATEGIA: \",NOMBRE!$B$3,\" - \",\"( \",NOMBRE!$C$3,NOMBRE!$D$3,NOMBRE!$E$3,NOMBRE!$F$3,NOMBRE!$G$3,NOMBRE!$H$3,\" )\")","v":"ESTABLECIMIENTO/ESTRATEGIA:  - (  )"}]
[{"$f":"CONCATENATE(\"MES: \",NOMBRE!$B$6,\" - \",\"( \",NOMBRE!$C$6,NOMBRE!$D$6,\" )\")","v":"MES:  - (  )"}]
[{"$f":"CONCATENATE(\"AÑO: \",NOMBRE!$B$7)","v":"AÑO: 2023"}]
[]
["REM-P12. PERSONAS CON PAP – MAMOGRAFIA - EXAMEN FISICO DE MAMA VIGENTES Y PRODUCCION DE PAP Y VPH (SEMESTRAL)"]
["SECCION A: PROGRAMA DE CANCER DE CUELLO UTERINO: POBLACIÓN CON PAP VIGENTE"]
["GRUPOS DE EDAD (en años)","MUJERES\ncon PAP Vigente \nen los ultimos 3 años","TRANS MASCULINO\ncon PAP Vigente \nen los ultimos 3 años"]
["Menor de 25 años"]
["25 a 29 años "]
["30 a 34 años"]
["35 a 39 años"]
["40 a 44 años"]
["45 a 49 años"]
["50 a 54 años"]
["55 a 59 años"]
["60 a 64 años"]
["65 a 69 años"]
["70 a 74 años"]
["75 a 79 años"]
["80 y más años"]
["TOTAL",{"$f":"SUM(B10:B22)","v":0},{"$f":"SUM(C10:C22)","v":0}]
["(*) FUENTE DE INFORMACIÓN: CITOEXPERT O REVICAN"]
["SECCIÓN B. PROGRAMA DE CANCER DE CUELLO UTERINO: PAP REALIZADOS E INFORMADOS SEGÚN RESULTADOS Y GRUPOS DE EDAD\n(Examen realizados en la red pública)"]
["GRUPO DE EDAD \n(en años)","PAP INFORMADOS SEGÚN RESULTADO"]
[null,"TOTAL","NORMALES","INADECUADOS Y ATIPICOS",null,"POSITIVOS",null,null,null,null,null,"TOTAL PAP INFORMADOS EN TRANS MASCULINO "]
[null,null,null,"INADECUADOS","ATIPICOS"," HPV","NIE I","NIE II"," NIE III","Ca. Inv. (Epidermoide)","Ca. Inv. (Adenocarcinoma)"]
["Menor de 25 años",{"$f":"SUM(C29:K29)","v":0}]
["25 a 29 años ",{"$f":"SUM(C30:K30)","v":0}]
["30 a 34 años",0]
["35 a 39 años",0]
["40 a 44 años",0]
["45 a 49 años",0]
["50 a 54 años",0]
["55 a 59 años",0]
["60 a 64 años",{"$f":"SUM(C37:K37)","v":0}]
["65 a 69 años",0]
["70 a 74 años",0]
["75 a 79 años",0]
["80 y más años",0]
["TOTAL",{"$f":"SUM(C42:K42)","v":0},{"$f":"SUM(C29:C41)","v":0},0,0,0,0,0,0,0,0,{"$f":"SUM(L29:L41)","v":0}]
["(*) FUENTE DE INFORMACIÓN: CITOEXPERT O REVICAN"]
["SECCIÓN B.1 PROGRAMA DE CANCER DE CUELLO UTERINO: PAP REALIZADOS E INFORMADOS SEGÚN RESULTADOS Y GRUPOS DE EDAD\n(Examen realizados en extrasistema)"]
["GRUPO DE EDAD \n(en años)","PAP INFORMADOS SEGÚN RESULTADO"]
[null,"TOTAL","NORMALES","INADECUADOS Y ATIPICOS",null,"POSITIVOS",null,null,null,null,null,"TOTAL PAP INFORMADOS EN TRANS MASCULINO "]
[null,null,null,"INADECUADOS","ATIPICOS"," HPV","NIE I","NIE II"," NIE III","Ca. Inv. (Epidermoide)","Ca. Inv. (Adenocarcinoma)"]
["Menor de 25 años",{"$f":"SUM(C48:K48)","v":0}]
["25 a 29 años ",{"$f":"SUM(C49:K49)","v":0}]
["30 a 34 años",{"$f":"SUM(C50:K50)","v":0}]
["35 a 39 años",0]
["40 a 44 años",0]
["45 a 49 años",0]
["50 a 54 años",0]
["55 a 59 años",0]
["60 a 64 años",0]
["65 a 69 años",0]
["70 a 74 años",{"$f":"SUM(C58:K58)","v":0}]
["75 a 79 años",{"$f":"SUM(C59:K59)","v":0}]
["80 y más años",{"$f":"SUM(C60:K60)","v":0}]
["TOTAL",{"$f":"SUM(C61:K61)","v":0},{"$f":"SUM(C48:C60)","v":0},{"$f":"SUM(D48:D60)","v":0},{"$f":"SUM(E48:E60)","v":0},0,0,0,0,0,0,{"$f":"SUM(L48:L60)","v":0}]
["(*) FUENTE DE INFORMACIÓN: CITOEXPERT O REVICAN"]
["SECCION C: PROGRAMA DE CANCER DE MAMA: MUJERES CON MAMOGRAFÍA VIGENTE EN LOS ULTIMOS 3 AÑOS. "]
["GRUPO DE EDAD \n(en años)","Mujeres con mamografia vigente  (Menor o igual a 3 años)"]
["Menor de 35 años"]
["35 a 49 años"]
["50 a 54 años"]
["55 a 59 años"]
["60 a 64 años"]
["65 a 69 años"]
["70 a 74 años"]
["75 a 79 años"]
["80 y más años"]
["TOTAL",{"$f":"SUM(B65:B73)","v":0}]
["(*) FUENTE DE INFORMACIÓN: TARJETERO POBLACIONAL DE LA APS"]
["SECCION D: PROGRAMA DE CANCER DE MAMA: NÚMERO DE MUJERES CON EXAMEN FÍSICO DE MAMA (VIGENTE)"]
["GRUPO DE EDAD \n(en años)","Mujeres con EFM vigente\n"]
["Menor de 35 años"]
["35 a 49 años"]
["50 a 54 años"]
["55 a 59 años"]
["60 a 64 años"]
["65 a 69 años"]
["70 a 74 años"]
["75 a 79 años"]
["80 y más años"]
["TOTAL",{"$f":"SUM(B78:B86)","v":0}]
["(*) FUENTE DE INFORMACIÓN: TARJETERO POBLACIONAL DE LA APS"]
["SECCION E: PROGRAMA DE CANCER DE CUELLO UTERINO: POBLACIÓN CON VPH VIGENTE"]
["GRUPOS DE EDAD (en años)","MUJERES\ncon Examen VPH Vigente \nen los ultimos 5 años","TRANS MASCULINO\ncon Examen VPH Vigente \nen los ultimos 5 años"]
["30 a 34 años"]
["35 a 39 años"]
["40 a 44 años"]
["45 a 49 años"]
["50 a 54 años"]
["55 a 59 años"]
["60 a 64 años"]
["TOTAL",{"$f":"SUM(B91:B97)","v":0},{"$f":"SUM(C91:C97)","v":0}]
["SECCIÓN F: PROGRAMA DE CANCER DE CUELLO UTERINO: RESULTADOS DE VPH  REALIZADOS EN EL SISTEMA PUBLICO SEGÚN GRUPOS DE EDAD \n(Examen realizados en la red pública)"]
["GRUPO DE EDAD \n(en años)","VPH INFORMADOS SEGÚN RESULTADO"]
[null,"TOTAL","VPH (-)","POSITIVOS",null,null,"TOTAL VPH  INFORMADOS EN TRANS MASCULINO "]
[null,null,null,"VPH 16 (+)","VPH 18 (+)","VPH AR* (+) "]
["30 a 34 años",{"$f":"SUM(C103:F103)","v":0}]
["35 a 39 años",{"$f":"SUM(C104:F104)","v":0}]
["40 a 44 años",0]
["45 a 49 años",0]
["50 a 54 años",0]
["55 a 59 años",0]
["60 a 64 años",0]
["65 a 69 años",0]
["70 a 74 años",0]
["75 a 79 años",0]
["80 y más años",0]
["TOTAL",{"$f":"SUM(C114:F114)","v":0},{"$f":"SUM(C103:C113)","v":0},{"$f":"SUM(D103:D113)","v":0},{"$f":"SUM(E103:E113)","v":0},{"$f":"SUM(F103:F113)","v":0},{"$f":"SUM(G103:G113)","v":0}]
["* Agrupados Alto Riesgo"]
["SECCIÓN F.1: PROGRAMA DE CANCER DE CUELLO UTERINO: RESULTADOS DE  VPH, REALIZADOS EN EL EXTRASISTEMA SEGÚN  GRUPOS DE EDAD (Examen realizados en extrasistema)"]
["GRUPO DE EDAD \n(en años)","VPH INFORMADOS SEGÚN RESULTADO"]
[null,"TOTAL","VPH (-)","POSITIVOS",null,null,"TOTAL VPH  INFORMADOS EN TRANS MASCULINO "]
[null,null,null,"VPH 16 (+)","VPH 18 (+)","VPH AR (+) "]
["30 a 34 años",{"$f":"SUM(C120:F120)","v":0}]
["35 a 39 años",{"$f":"SUM(C121:F121)","v":0}]
["40 a 44 años",0]
["45 a 49 años",0]
["50 a 54 años",0]
["55 a 59 años",0]
["60 a 64 años",0]
["65 a 69 años",0]
["70 a 74 años",0]
["75 a 79 años",0]
["80 y más años",0]
["TOTAL",{"$f":"SUM(C131:F131)","v":0},{"$f":"SUM(C120:C130)","v":0},{"$f":"SUM(D120:D130)","v":0},{"$f":"SUM(E120:E130)","v":0},{"$f":"SUM(F120:F130)","v":0},{"$f":"SUM(G120:G130)","v":0}]
[]
[]
[]
[]
[]
[]
[]
[]
[]
[]
[]
[]
[]
[]
[]
[]
[]
[]
[]
[]
[]
[]
[]
[]
[]
[]
[]
[]
[]
[]
[]
[]
[]
[]
[]
[]
[]
[]
[]
[]
[]
[]
[]
[]
[]
[]
[]
[]
[]
[]
[]
[]
[]
[]
[]
[]
[]
[]
[]
[]
[]
[]
[]
[]
[]
[]
[]
[{"$f":"SUM(B10:C22,C29:L41,C48:L60,B65:B73,B78:B86,B91:C97,C103:G113,C120:G130)","v":0},"datos"]
[{"$f":"SUM(BA$10:BZ130)","v":0},"errores"]

{"sheet":"P13","index":11,"n_rows":41,"n_cols":71,"rows_kept":41,"cut":false,"hidden":false,"merged":[[9,12,9,13],[9,14,9,15],[9,8,9,9],[17,18,19,18],[17,19,19,19],[17,17,19,17],[8,17,10,17],[8,16,10,16],[17,16,19,16],[8,0,10,0],[8,1,9,3],[8,4,8,15],[6,1,6,12],[17,0,19,0],[17,1,18,3],[17,4,17,15],[18,4,18,5],[18,6,18,7],[18,8,18,9],[9,4,9,5],[9,6,9,7],[18,10,18,11],[18,12,18,13],[18,14,18,15],[9,10,9,11]]}
["DATOS DEL ESTABLECIMIENTO"]
[{"$f":"CONCATENATE(\"COMUNA: \",NOMBRE!$B$2,\" - \",\"( \",NOMBRE!$C$2,NOMBRE!$D$2,NOMBRE!$E$2,NOMBRE!$F$2,NOMBRE!$G$2,\" )\")","v":"COMUNA:  - (  )"}]
[{"$f":"CONCATENATE(\"ESTABLECIMIENTO/ESTRATEGIA: \",NOMBRE!$B$3,\" - \",\"( \",NOMBRE!$C$3,NOMBRE!$D$3,NOMBRE!$E$3,NOMBRE!$F$3,NOMBRE!$G$3,NOMBRE!$H$3,\" )\")","v":"ESTABLECIMIENTO/ESTRATEGIA:  - (  )"}]
[{"$f":"CONCATENATE(\"MES: \",NOMBRE!$B$6,\" - \",\"( \",NOMBRE!$C$6,NOMBRE!$D$6,\" )\")","v":"MES:  - (  )"}]
[{"$f":"CONCATENATE(\"AÑO: \",NOMBRE!$B$7)","v":"AÑO: 2023"}]
[]
[null,"REM-P13. NIÑOS, NIÑAS, ADOLESCENTES Y JÓVENES CON VULNERACIÓN DE DERECHOS Y/O INFRACCIÓN A LA LEY BAJO LA PROTECCIÓN DEL ESTADO EN ATENCIÓN"]
["SECCIÓN A: NIÑOS, NIÑAS, ADOLESCENTES Y JÓVENES CON VULNERACIÓN DE DERECHOS Y/O INFRACIÓN A LA LEY EN CONTROL DE SALUD EN APS AL CORTE"]
["Tipo de Programas SENAME","TOTAL",null,null,"POR EDAD ",null,null,null,null,null,null,null,null,null,null,null,"Migrantes","Pueblos Originarios"]
[null,null,null,null," 0 - 4",null," 5 - 9",null," 10 - 14 ",null,"15 a 19",null,"20 - 24",null,"Mayor a 25 años"]
[null,"Ambos sexos","Hombre","Mujer","Hombre","Mujer","Hombre","Mujer","Hombre","Mujer","Hombre","Mujer","Hombre","Mujer","Hombre","Mujer"]
["TOTAL",{"$f":"SUM(C12:D12)","v":0},{"$f":"SUM(C14:C16)","v":0},{"$f":"SUM(D14:D16)","v":0},{"$f":"SUM(E14:E16)","v":0},{"$f":"SUM(F14:F16)","v":0},0,0,0,0,0,0,0,0,0,0,{"$f":"SUM(Q14:Q16)","v":0},{"$f":"SUM(R14:R16)","v":0},{"$f":"BA12&BB12&BC12&BD12","v":""},null,null,null,null,null,null,null,null,null,null,null,null,null,null,null,null,null,null,null,null,null,null,null,null,null,null,null,null,null,null,null,null,null,{"$f":"IF(BP12=1,\" * El total de Migrantes no debe superar el total de población ingresada. \",\"\")","v":""},null,{"$f":"IF(BR12=1,\" * El total de Pueblos Originarios no debe superar el total de población ingresada. \",\"\")","v":""},null,null,null,null,null,null,null,null,null,null,null,null,{"$f":"IF(Q12>B12,1,0)","v":0},null,{"$f":"IF(R12>B12,1,0)","v":0}]
["AMBULATORIO",{"$f":"SUM(C13:D13)","v":0},{"$f":"+E13+G13+I13+K13+M13+O13","v":0},{"$f":"+F13+H13+J13+L13+N13+P13","v":0}]
["SANCIÓN EN MEDIO LIBRE",{"$f":"SUM(C14:D14)","v":0},{"$f":"+E14+G14+I14+K14+M14+O14","v":0},{"$f":"+F14+H14+J14+L14+N14+P14","v":0},null,null,null,null,null,null,null,null,null,null,null,null,null,null,"",null,null,null,null,null,null,null,null,null,null,null,null,null,null,null,null,null,null,null,null,null,null,null,null,null,null,null,null,null,null,null,null,null,{"$f":"IF(BP14=1,\" * El total de Migrantes no debe superar el total de población ingresada. \",\"\")","v":""},{"$f":"IF(BQ14=1,\"* No olvide ingresar la columna Migrantes (Digite Cero si no tiene). \",\"\")","v":""},{"$f":"IF(BR14=1,\" * El total de Pueblos Originarios no debe superar el total de población ingresada. \",\"\")","v":""},{"$f":"IF(BS14=1,\"* No olvide ingresar la columna Pueblos Originarios (Digite Cero si no tiene). \",\"\")","v":""},null,null,null,null,null,null,null,null,null,null,null,{"$f":"IF(Q14>B14,1,0)","v":0},{"$f":"IF(AND(B14<>0,Q14=\"\"),1,0)","v":0},{"$f":"IF(R14>B14,1,0)","v":0},{"$f":"IF(AND(B14<>0,R14=\"\"),1,0)","v":0}]
["RESIDENCIALES",{"$f":"SUM(C15:D15)","v":0},{"$f":"+E15+G15+I15+K15+M15+O15","v":0},0,null,null,null,null,null,null,null,null,null,null,null,null,null,null,"",null,null,null,null,null,null,null,null,null,null,null,null,null,null,null,null,null,null,null,null,null,null,null,null,null,null,null,null,null,null,null,null,null,{"$f":"IF(BP15=1,\" * El total de Migrantes no debe superar el total de población ingresada. \",\"\")","v":""},{"$f":"IF(BQ15=1,\"* No olvide ingresar la columna Migrantes (Digite Cero si no tiene). \",\"\")","v":""},{"$f":"IF(BR15=1,\" * El total de Pueblos Originarios no debe superar el total de población ingresada. \",\"\")","v":""},{"$f":"IF(BS15=1,\"* No olvide ingresar la columna Pueblos Originarios (Digite Cero si no tiene). \",\"\")","v":""},null,null,null,null,null,null,null,null,null,null,null,{"$f":"IF(Q15>B15,1,0)","v":0},{"$f":"IF(AND(B15<>0,Q15=\"\"),1,0)","v":0},{"$f":"IF(R15>B15,1,0)","v":0},{"$f":"IF(AND(B15<>0,R15=\"\"),1,0)","v":0}]
["CIP-CRC",{"$f":"SUM(C16:D16)","v":0},0,0,null,null,null,null,null,null,null,null,null,null,null,null,null,null,"",null,null,null,null,null,null,null,null,null,null,null,null,null,null,null,null,null,null,null,null,null,null,null,null,null,null,null,null,null,null,null,null,null,{"$f":"IF(BP16=1,\" * El total de Migrantes no debe superar el total de población ingresada. \",\"\")","v":""},{"$f":"IF(BQ16=1,\"* No olvide ingresar la columna Migrantes (Digite Cero si no tiene). \",\"\")","v":""},"","",null,null,null,null,null,null,null,null,null,null,null,{"$f":"IF(Q16>B16,1,0)","v":0},{"$f":"IF(AND(B16<>0,Q16=\"\"),1,0)","v":0},0,{"$f":"IF(AND(B16<>0,R16=\"\"),1,0)","v":0}]
["SECCIÓN B: VARIABLES DE SEGUIMIENTO A POBLACIÓN DEL SERVICIO DE PROTECCIÓN ESPECIALIZADA MEJOR NIÑEZ Y SENAME EN CONTROL DE SALUD EN APS AL CORTE"]
["Variable","TOTAL",null,null,"POR EDAD ",null,null,null,null,null,null,null,null,null,null,null,"Migrantes","Pueblos Originarios","Servicio de Protección Especializada","SENAME"]
[null,null,null,null," 0 - 4",null," 5 - 9",null," 10 - 14 ",null,"15 a 19",null,"20 a 24",null,"Mayor a 25 años"]
[null,"Ambos sexos","Hombre","Mujer","Hombre","Mujer","Hombre","Mujer","Hombre","Mujer","Hombre","Mujer","Hombre","Mujer","Hombre","Mujer"]
["POBLACIÓN EN CONTROL CON MÉTODO DE REGULACIÓN DE FERTILIDAD",{"$f":"SUM(C21:D21)","v":0},{"$f":"+I21+K21+M21+O21","v":0},{"$f":"+J21+L21+N21+P21","v":0},null,null,null,null,null,null,null,null,null,null,null,null,null,null,null,null,null,null,null,null,null,null,null,null,null,null,null,null,null,null,null,null,null,null,null,null,null,null,null,null,null,null,null,null,null,null,null,null,{"$f":"IF(BP21=1,\" * El total de Migrantes no debe superar el total de población ingresada. \",\"\")","v":""},{"$f":"IF(BQ21=1,\"* No olvide ingresar la columna Migrantes (Digite Cero si no tiene). \",\"\")","v":""},{"$f":"IF(BR21=1,\" * El total de Pueblos Originarios no debe superar el total de población ingresada. \",\"\")","v":""},{"$f":"IF(BS21=1,\"* No olvide ingresar la columna Pueblos Originarios (Digite Cero si no tiene). \",\"\")","v":""},null,null,null,null,null,null,null,null,null,null,null,{"$f":"IF(Q21>B21,1,0)","v":0},{"$f":"IF(AND(B21<>0,Q21=\"\"),1,0)","v":0},{"$f":"IF(R21>B21,1,0)","v":0},{"$f":"IF(AND(B21<>0,R21=\"\"),1,0)","v":0}]
["GESTANTES EN CONTROL CON RIESGO PSICOSOCIAL",0,{"$f":"+I22+K22+M22+O22","v":0},{"$f":"+J22+L22+N22+P22","v":0},null,null,null,null,null,null,null,null,null,null,null,null,null,null,null,null,null,null,null,null,null,null,null,null,null,null,null,null,null,null,null,null,null,null,null,null,null,null,null,null,null,null,null,null,null,null,null,null,"","","","",null,null,null,null,null,null,null,null,null,null,null,0,0,0,0]
["POBLACIÓN INFANTIL EN CONTROL",0,{"$f":"+E23+G23","v":0},{"$f":"+F23+H23","v":0},null,null,null,null,null,null,null,null,null,null,null,null,null,null,null,null,null,null,null,null,null,null,null,null,null,null,null,null,null,null,null,null,null,null,null,null,null,null,null,null,null,null,null,null,null,null,null,null,"","","","",null,null,null,null,null,null,null,null,null,null,null,0,0,0,0]
["POBLACIÓN EN CONTROL DE SALUD INTEGRAL DE ADOLESCENTES SEGÚN ÁREA DE RIESGO",0,{"$f":"+I24+K24+M24+O24","v":0},{"$f":"+J24+L24+N24+P24","v":0},null,null,null,null,null,null,null,null,null,null,null,null,null,null,null,null,null,null,null,null,null,null,null,null,null,null,null,null,null,null,null,null,null,null,null,null,null,null,null,null,null,null,null,null,null,null,null,null,"","","","",null,null,null,null,null,null,null,null,null,null,null,0,0,0,0]
["POBLACIÓN EN CONTROL DE SALUD MENTAL",0,{"$f":"+E25+G25+I25+K25+M25+O25","v":0},{"$f":"+F25+H25+J25+L25+N25+P25","v":0},null,null,null,null,null,null,null,null,null,null,null,null,null,null,null,null,null,null,null,null,null,null,null,null,null,null,null,null,null,null,null,null,null,null,null,null,null,null,null,null,null,null,null,null,null,null,null,null,"","","","",null,null,null,null,null,null,null,null,null,null,null,0,0,0,0]
["POBLACIÓN EN PROGRAMA DE ACOMPAÑAMIENTO PSICOSOCIAL",{"$f":"SUM(C26:D26)","v":0},{"$f":"+E26+G26+I26+K26+M26","v":0},{"$f":"+F26+H26+J26+L26+N26","v":0},null,null,null,null,null,null,null,null,null,null,null,null,null,null,null,null,null,null,null,null,null,null,null,null,null,null,null,null,null,null,null,null,null,null,null,null,null,null,null,null,null,null,null,null,null,null,null,null,"","","","",null,null,null,null,null,null,null,null,null,null,null,0,0,0,0]
[]
[]
[]
[]
[]
[]
[]
[]
[]
[]
[]
[]
[]
[{"$f":"SUM(#REF!,B12:P16,B21:P26,#REF!)","v":{"$error":"#REF!"}},"datos"]
[{"$f":"SUM(BP5:BS26)","v":0},"errores"]

{"sheet":"Contro","index":12,"n_rows":19,"n_cols":24,"rows_kept":19,"cut":false,"hidden":false,"merged":[]}
[null,null,"NUMERO DE ERRORES SEGÚN :"]
[null,null,"A.- DIFERENCIAS ENTRE POBLACIÓN EN CONTROL Y ESTADO NUTRICIONAL"]
[null,null,"B.- DESGLOSE DE POBLACIÓN SEGÚN CONDICIÓN, PATOLOGÍA, SEXO, ETC."]
[null,null,{"$f":"CONCATENATE(\"ESTABLECIMIENTO/ESTRATEGIA: \",NOMBRE!$B$3,\" - \",\"( \",NOMBRE!$C$3,NOMBRE!$D$3,NOMBRE!$E$3,NOMBRE!$F$3,NOMBRE!$G$3,NOMBRE!$H$3,NOMBRE!$I$3,\" )\")","v":"ESTABLECIMIENTO/ESTRATEGIA:  - ( Falta Cód. Est. )"}]
[null,null,"REM","Nº ERRORES","JUSTIFICAR ERRORES (indicar)","REM\nSIN DATOS","CAUSAL","OTRA CAUSAL (indicar)"]
[null,null,"HOJA NOMBRE",{"$f":"NOMBRE!AG7","v":5}]
[null,null,"REM P1",{"$f":"+'P1'!$A149","v":{"$error":"#REF!"}},null,{"$f":"IF('P1'!A148>0,\"\",\"SIN DATOS\")","v":{"$error":"#REF!"}},null,null,null,null,null,null,null,null,null,null,null,null,null,null,null,null,null,"Licencia médica"]
[null,null,"REM P2",{"$f":"+'P2'!A205","v":"EVALUACIÓN DE RIESGO SEGÚN PAUTA CERO"},null,{"$f":"IF('P2'!A204>0,\"\",\"SIN DATOS\")","v":""},null,null,null,null,null,null,null,null,null,null,null,null,null,null,null,null,null,"Feriado Legal"]
[null,null,"REM P3",{"$f":"+'P3'!A87","v":{"$error":"#REF!"}},null,{"$f":"IF('P3'!A86>0,\"\",\"SIN DATOS\")","v":"SIN DATOS"},null,null,null,null,null,null,null,null,null,null,null,null,null,null,null,null,null,"No hubo profesional"]
[null,null,"REM P4",{"$f":"+'P4'!A100","v":0},null,{"$f":"IF('P4'!A99>0,\"\",\"SIN DATOS\")","v":"SIN DATOS"},null,null,null,null,null,null,null,null,null,null,null,null,null,null,null,null,null,"No corresponde REM"]
[null,null,"REM P5",{"$f":"+'P5'!A82","v":0},null,{"$f":"IF('P5'!A81>0,\"\",\"SIN DATOS\")","v":"SIN DATOS"},null,null,null,null,null,null,null,null,null,null,null,null,null,null,null,null,null,"Otra causa justificada"]
[null,null,"REM P6",{"$f":"+'P6'!A143","v":0},null,{"$f":"IF('P6'!A142>0,\"\",\"SIN DATOS\")","v":"SIN DATOS"}]
[null,null,"REM P7",{"$f":"+'P7'!A51","v":0},null,{"$f":"IF('P7'!A50>0,\"\",\"SIN DATOS\")","v":"SIN DATOS"}]
[null,null,"REM P9",{"$f":"+'P9'!A108","v":0},null,{"$f":"IF('P9'!A107>0,\"\",\"SIN DATOS\")","v":"SIN DATOS"}]
[null,null,"REM P11",{"$f":"+'P11'!A34","v":0},null,{"$f":"IF('P11'!A33>0,\"\",\"SIN DATOS\")","v":"SIN DATOS"}]
[null,null,"REM P12",{"$f":"+'P12'!A200","v":0},null,{"$f":"IF('P12'!A199>0,\"\",\"SIN DATOS\")","v":"SIN DATOS"}]
[null,null,"REM P13",{"$f":"+'P13'!A41","v":0},null,{"$f":"IF('P13'!A40>0,\"\",\"SIN DATOS\")","v":{"$error":"#REF!"}}]
[]
[null,null,"TOTAL",{"$f":"SUM(D6:D17)","v":{"$error":"#REF!"}}]

{"sheet":"MACROS","index":13,"n_rows":13,"n_cols":2,"rows_kept":13,"cut":false,"hidden":false,"merged":[[0,0,0,13],[9,1,10,7]]}
["Hoja de Macros y Utilidades"]
[]
[{"$f":"CONCATENATE(\"ESTABLECIMIENTO/ESTRATEGIA: \",NOMBRE!B3,\" - \",\"( \",NOMBRE!C3,NOMBRE!D3,NOMBRE!E3,NOMBRE!F3,NOMBRE!G3,NOMBRE!H3,\" )\")","v":"ESTABLECIMIENTO/ESTRATEGIA:  - (  )"}]
[null,"DESPROTEGER HOJAS"]
[]
[null,"PROTEGER HOJAS"]
[]
[null,"CREA UNA COPIA DEL ARCHIVO (TRANFORMA HOJAS A VALORES)"]
[]
[null,{"$f":"IF(Contro!D19>0,\"REVISE LA HOJA CONTROL, EXISTEN ERRORES\",\"\")","v":{"$error":"#REF!"}}]
[]
[]
[null,"Contraseña para copia del archivo :DEIS"]